program: Orca
programVersion: 4.2.1
elementType: Cl O N N N C C C C C C C C C C C C C C C C C H H H H H H H H H H H H H H H H H H H H H H
charge: 0
multiplicity: 1
keywords: wb97x-d3
keywords: def2-TZVPP
keywords: def2/J RIJCOSX GRIDX6 NOFINALGRIDX
keywords: grid4 nofinalgrid
keywords: scfconv7
keywords: smallprint printgap noloewdin
keywords: NOSOSCF
formula: C17H22ClN3O
InChI: InChI=1S/C17H22ClN3O/c1-16(2)8-7-14(9-13-3-5-15(18)6-4-13)17(16,22)10-21-12-19-11-20-21/h3-6,11-12,14,22H,7-10H2,1-2H3
44 atoms
Cl 4.596625 3.80944 1.054255
O  -2.366241 -1.354837 1.322565
N  -1.145133 -2.804954 -0.928644
N  -0.918249 -3.467697 0.210195
N  0.553239 -4.094516 -1.35467
C  -2.18707 -0.744751 0.064552
C  -3.351248 0.261848 -0.20349
C  -0.953232 0.187908 0.021888
C  -2.767098 1.165899 -1.305928
C  -1.233698 1.130499 -1.150587
C  -2.201083 -1.817995 -1.040318
C  0.446973 -0.430802 0.004672
C  -3.650814 1.087857 1.053438
C  -4.664243 -0.386669 -0.637219
C  1.499885 0.611975 0.262292
C  -0.262858 -3.189396 -1.845947
C  1.755532 1.057342 1.557661
C  2.223808 1.181128 -0.781075
C  2.702488 2.037515 1.811513
C  3.175336 2.164754 -0.549419
C  0.10974 -4.221888 -0.092236
C  3.405988 2.584932 0.749761
H  -1.011026 0.766967 0.949087
H  -3.168457 2.177722 -1.230997
H  -3.056317 0.796163 -2.292327
H  -0.764673 0.753403 -2.063441
H  -0.81005 2.119436 -0.976048
H  -2.106408 -1.374543 -2.030852
H  -3.14931 -2.353901 -1.014621
H  0.654386 -0.900432 -0.9583
H  0.523708 -1.206104 0.771329
H  -4.387183 1.854711 0.806748
H  -4.075331 0.477695 1.850973
H  -2.780039 1.605004 1.456803
H  -4.602524 -0.875604 -1.610011
H  -5.011554 -1.122348 0.091369
H  -5.441511 0.375257 -0.721712
H  -1.807554 -2.146383 1.365573
H  -0.250328 -2.789883 -2.847772
H  1.211811 0.628989 2.391356
H  2.050752 0.852754 -1.798737
H  2.890094 2.364363 2.825301
H  3.728483 2.591928 -1.374736
H  0.550617 -4.891508 0.628933
elementType: Cl O N C H
totalener: -1360.84237286 hartree
nucrepener: 1984.66896454 hartree
electener: -3345.51133739 hartree
oneelecener: -5801.42850878 hartree
twoeener: 2455.91717139 hartree
cpcmener: -0.03072631 hartree
kineticenergy: 1356.14287778 hartree
xcener: -110.266330532457 hartree
chargesum: -0.0000000
charge: -0.108033 -0.473458 0.148091 -0.386733 -0.408776 0.495670 0.234145 -0.121960 -0.270175 -0.194056 -0.237746 -0.101186 -0.365930 -0.345136 0.023225 0.047986 -0.223628 -0.219897 -0.173098 -0.160307 0.082459 0.102897 0.091833 0.081917 0.089910 0.085771 0.088333 0.128419 0.146321 0.093180 0.112843 0.097901 0.093734 0.103962 0.087717 0.099707 0.105757 0.227543 0.184614 0.142719 0.138225 0.145445 0.144066 0.165731
qa: -0.1080 -0.4735 0.1481 -0.3867 -0.4088 0.4957 0.2341 -0.1220 -0.2702 -0.1941 -0.2377 -0.1012 -0.3659 -0.3451 0.0232 0.0480 -0.2236 -0.2199 -0.1731 -0.1603 0.0825 0.1029 0.0918 0.0819 0.0899 0.0858 0.0883 0.1284 0.1463 0.0932 0.1128 0.0979 0.0937 0.1040 0.0877 0.0997 0.1058 0.2275 0.1846 0.1427 0.1382 0.1454 0.1441 0.1657
va: 1.1973 1.9720 3.3298 2.8473 3.0271 3.6734 3.6989 3.9034 4.0268 3.8791 3.9894 3.7680 3.9415 3.9134 3.5639 4.0471 3.9846 3.9705 4.0010 4.0044 4.0077 3.8053 1.0171 1.0121 1.0054 1.0074 1.0062 0.9851 0.9878 1.0083 1.0273 1.0041 1.0132 0.9976 0.9985 1.0111 1.0025 1.0617 0.9899 1.0069 1.0066 1.0053 1.0058 0.9933
dispcorr: -0.025404070 hartree
energy: -1360.867776925563
dipole: -35.20566 33.86867 -1.33700 -5.47180 5.61292 0.14112 -6.75182 5.18464 -1.56717
magnitude: 2.06483 au
magnitude: 5.24838 debye
