program: Orca
programVersion: 4.2.1
elementType: Cl O N N N C C C C C C C C C C C C C C C C C H H H H H H H H H H H H H H H H H H H H H H
charge: 0
multiplicity: 1
keywords: wb97x-d3
keywords: def2-TZVPP
keywords: def2/J RIJCOSX GRIDX6 NOFINALGRIDX
keywords: grid4 nofinalgrid
keywords: scfconv7
keywords: smallprint printgap noloewdin
keywords: NOSOSCF
formula: C17H22ClN3O
InChI: InChI=1S/C17H22ClN3O/c1-16(2)8-7-14(9-13-3-5-15(18)6-4-13)17(16,22)10-21-12-19-11-20-21/h3-6,11-12,14,22H,7-10H2,1-2H3
44 atoms
Cl 4.636343 3.851327 0.765755
O  -2.323574 -1.140157 1.420055
N  -1.151118 -2.880243 -0.597651
N  -0.221912 -3.157961 -1.516593
N  0.058015 -4.456658 0.281934
C  -2.202363 -0.685859 0.093235
C  -3.347955 0.290349 -0.348314
C  -0.96331 0.224103 0.002238
C  -2.699512 1.067827 -1.511229
C  -1.1753 1.013017 -1.291517
C  -2.184518 -1.896603 -0.857516
C  0.423327 -0.410595 0.127852
C  -3.705101 1.247833 0.794615
C  -4.642956 -0.395855 -0.782098
C  1.48823 0.639881 0.286807
C  -0.975491 -3.667546 0.46649
C  2.275111 1.037964 -0.789865
C  1.698581 1.261123 1.516225
C  3.242279 2.024071 -0.654933
C  2.6605 2.246735 1.673575
C  0.482312 -4.102119 -0.9451
C  3.42637 2.621717 0.580542
H  -1.058471 0.915778 0.845458
H  -3.076059 2.091568 -1.548189
H  -2.962648 0.614053 -2.469564
H  -0.686124 0.506526 -2.12812
H  -0.727814 2.004957 -1.229976
H  -2.056952 -1.590917 -1.894748
H  -3.14256 -2.415276 -0.796896
H  0.652168 -1.010499 -0.753331
H  0.449967 -1.079404 0.992275
H  -4.151578 0.728714 1.644273
H  -2.855743 1.820449 1.167957
H  -4.441695 1.971539 0.440339
H  -4.529093 -1.002929 -1.680605
H  -5.059467 -1.032408 0.003928
H  -5.400951 0.356438 -1.009394
H  -3.177522 -1.572731 1.535137
H  -1.610735 -3.645463 1.335704
H  2.140464 0.569329 -1.757366
H  1.107224 0.968026 2.37596
H  3.844641 2.315283 -1.504983
H  2.811493 2.711432 2.638681
H  1.331187 -4.553849 -1.43464
elementType: Cl O N C H
totalener: -1360.84925240 hartree
nucrepener: 1978.91605415 hartree
electener: -3339.76530655 hartree
oneelecener: -5790.15340709 hartree
twoeener: 2450.38810054 hartree
cpcmener: -0.02858253 hartree
kineticenergy: 1356.11820300 hartree
xcener: -110.256389251651 hartree
chargesum: 0.0000000
charge: -0.106601 -0.408885 0.137770 -0.362149 -0.409522 0.422856 0.197843 -0.057782 -0.262263 -0.205367 -0.245310 -0.106274 -0.350251 -0.339601 0.028950 0.076360 -0.215183 -0.222030 -0.156868 -0.168775 0.062825 0.102262 0.092267 0.081932 0.090637 0.085232 0.088405 0.126414 0.145919 0.085923 0.111074 0.089000 0.104876 0.097813 0.091180 0.095893 0.107408 0.214533 0.158039 0.135281 0.140827 0.141798 0.142314 0.161233
qa: -0.1066 -0.4089 0.1378 -0.3621 -0.4095 0.4229 0.1978 -0.0578 -0.2623 -0.2054 -0.2453 -0.1063 -0.3503 -0.3396 0.0289 0.0764 -0.2152 -0.2220 -0.1569 -0.1688 0.0628 0.1023 0.0923 0.0819 0.0906 0.0852 0.0884 0.1264 0.1459 0.0859 0.1111 0.0890 0.1049 0.0978 0.0912 0.0959 0.1074 0.2145 0.1580 0.1353 0.1408 0.1418 0.1423 0.1612
va: 1.1985 2.0387 3.3509 2.8620 3.0444 3.8186 3.8019 3.8099 4.0018 3.9121 3.9596 3.7693 3.9501 3.9194 3.5466 4.0534 3.9703 3.9914 4.0031 4.0047 4.0345 3.8136 1.0222 1.0116 1.0057 1.0081 1.0068 1.0043 0.9847 1.0326 1.0219 1.0122 0.9979 1.0045 0.9988 1.0046 1.0023 1.0184 1.0164 1.0080 1.0064 1.0063 1.0062 0.9962
dispcorr: -0.025412562 hartree
energy: -1360.874664961920
dipole: -36.93704 34.09383 -2.84321 -5.62465 5.94212 0.31747 -5.87625 5.48821 -0.38803
magnitude: 2.88708 au
magnitude: 7.33837 debye
