program: Orca
programVersion: 4.2.1
elementType: Cl O N N N C C C C C C C C C C C C C C C C C H H H H H H H H H H H H H H H H H H H H H H
charge: 0
multiplicity: 1
keywords: wb97x-d3
keywords: def2-TZVPP
keywords: def2/J RIJCOSX GRIDX6 NOFINALGRIDX
keywords: grid4 nofinalgrid
keywords: scfconv7
keywords: smallprint printgap noloewdin
keywords: NOSOSCF
formula: C17H22ClN3O
InChI: InChI=1S/C17H22ClN3O/c1-16(2)8-7-14(9-13-3-5-15(18)6-4-13)17(16,22)10-21-12-19-11-20-21/h3-6,11-12,14,22H,7-10H2,1-2H3
44 atoms
Cl 4.547187 3.896366 0.767774
O  -2.340175 -1.140302 1.44022
N  -1.155378 -2.868276 -0.630888
N  -0.306942 -3.148809 -1.626446
N  0.180394 -4.382138 0.178644
C  -2.213503 -0.697437 0.109317
C  -3.337234 0.29945 -0.34015
C  -0.957121 0.183645 0.001722
C  -2.672398 1.04792 -1.51626
C  -1.147985 0.921013 -1.323308
C  -2.222171 -1.915158 -0.831926
C  0.423201 -0.452827 0.178035
C  -3.673052 1.282379 0.788586
C  -4.648913 -0.364752 -0.762017
C  1.477098 0.60976 0.328689
C  -0.851141 -3.618045 0.438288
C  2.283941 0.983179 -0.740144
C  1.648083 1.275157 1.53959
C  3.228212 1.991155 -0.616364
C  2.586806 2.283063 1.684578
C  0.477078 -4.055286 -1.094447
C  3.372376 2.637876 0.5992
H  -1.055023 0.910074 0.81448
H  -2.999022 2.088675 -1.542812
H  -2.976322 0.614447 -2.471859
H  -0.703441 0.343907 -2.138787
H  -0.642181 1.885844 -1.320902
H  -2.155244 -1.615179 -1.876562
H  -3.171722 -2.44529 -0.720281
H  0.673531 -1.082626 -0.675927
H  0.425861 -1.092472 1.063713
H  -4.404312 2.006974 0.426932
H  -4.113897 0.786987 1.654466
H  -2.812564 1.848446 1.141498
H  -4.547459 -1.000186 -1.641673
H  -5.086635 -0.96729 0.039708
H  -5.386767 0.399229 -1.011468
H  -3.227283 -1.488452 1.572289
H  -1.387007 -3.569892 1.371441
H  2.17773 0.47515 -1.691116
H  1.039936 0.995446 2.3922
H  3.848682 2.268097 -1.457487
H  2.711328 2.785797 2.633797
H  1.288973 -4.500138 -1.648147
totalener: -1360.81938095 hartree
nucrepener: 1983.26121564 hartree
electener: -3344.08059659 hartree
oneelecener: -5798.66679613 hartree
twoeener: 2454.58619954 hartree
kineticenergy: 1356.13926099 hartree
xcener: -110.256815319155 hartree
chargesum: -0.0000000
charge: -0.088017 -0.345583 0.139844 -0.328948 -0.324763 0.428684 0.161875 -0.063877 -0.275158 -0.195735 -0.285571 -0.130975 -0.312768 -0.315974 0.052610 0.047162 -0.201856 -0.203034 -0.127592 -0.146303 0.061123 0.093744 0.086965 0.081328 0.087233 0.083772 0.094716 0.127891 0.124936 0.086509 0.120733 0.090768 0.080893 0.103587 0.088431 0.079003 0.105316 0.173309 0.138957 0.114167 0.121290 0.119585 0.119557 0.132164
qa: -0.0880 -0.3456 0.1398 -0.3289 -0.3248 0.4287 0.1619 -0.0639 -0.2752 -0.1957 -0.2856 -0.1310 -0.3128 -0.3160 0.0526 0.0472 -0.2019 -0.2030 -0.1276 -0.1463 0.0611 0.0937 0.0870 0.0813 0.0872 0.0838 0.0947 0.1279 0.1249 0.0865 0.1207 0.0908 0.0809 0.1036 0.0884 0.0790 0.1053 0.1733 0.1390 0.1142 0.1213 0.1196 0.1196 0.1322
va: 1.2184 2.0899 3.3071 2.8318 3.0736 3.7659 3.8449 3.7898 3.9960 3.9078 4.0206 3.7963 3.9545 3.9162 3.6063 4.0581 3.9977 4.0149 4.0213 4.0323 4.0376 3.9132 1.0265 1.0142 1.0083 1.0132 1.0094 1.0050 0.9854 1.0329 1.0213 1.0058 1.0164 1.0028 1.0002 1.0086 1.0070 1.0544 1.0251 1.0130 1.0108 1.0128 1.0133 1.0019
dispcorr: -0.025564548 hartree
energy: -1360.844945499863
dipole: -36.53336 34.44031 -2.09305 -5.80595 6.16329 0.35734 -5.63085 5.42173 -0.20913
magnitude: 2.13360 au
magnitude: 5.42319 debye
