program: Orca
programVersion: 4.2.1
elementType: Cl O N N N C C C C C C C C C C C C C C C C C H H H H H H H H H H H H H H H H H H H H H H
charge: 0
multiplicity: 1
keywords: wb97x-d3
keywords: def2-TZVPP
keywords: def2/J RIJCOSX GRIDX6 NOFINALGRIDX
keywords: grid4 nofinalgrid
keywords: scfconv7
keywords: smallprint printgap noloewdin
keywords: NOSOSCF
formula: C17H22ClN3O
InChI: InChI=1S/C17H22ClN3O/c1-16(2)8-7-14(9-13-3-5-15(18)6-4-13)17(16,22)10-21-12-19-11-20-21/h3-6,11-12,14,22H,7-10H2,1-2H3
44 atoms
Cl 4.421591 1.504309 2.305486
O  -1.218074 -0.291001 1.26053
N  -0.57085 -2.038918 -0.927088
N  -0.165374 -2.220246 -2.189135
N  1.344734 -3.0585 -0.761339
C  -1.96675 -0.174832 0.076503
C  -3.474588 0.143785 0.379738
C  -1.586671 1.028128 -0.813282
C  -3.995493 0.639512 -0.986801
C  -2.771465 1.152538 -1.770692
C  -1.896302 -1.538226 -0.634863
C  -0.227811 1.085075 -1.51205
C  -3.584466 1.254387 1.431461
C  -4.286213 -1.040285 0.904512
C  0.943755 1.196665 -0.569376
C  0.340077 -2.552277 -0.088058
C  2.003983 0.299141 -0.624709
C  1.004407 2.213416 0.385451
C  3.074789 0.38409 0.251798
C  2.067618 2.316504 1.268167
C  0.987883 -2.828142 -2.040536
C  3.098522 1.392193 1.199968
H  -1.619062 1.899417 -0.1504
H  -4.752682 1.414371 -0.856345
H  -4.487908 -0.169721 -1.530725
H  -2.597157 0.550096 -2.666006
H  -2.89104 2.180575 -2.114477
H  -2.435352 -1.533781 -1.580836
H  -2.375645 -2.280799 0.002184
H  -0.242925 1.973602 -2.153029
H  -0.093682 0.237969 -2.184973
H  -4.63663 1.491525 1.597249
H  -3.160764 0.943761 2.385512
H  -3.099481 2.185671 1.138969
H  -4.418023 -1.834089 0.168708
H  -3.832626 -1.473993 1.798042
H  -5.288192 -0.708123 1.181077
H  -0.468928 0.311147 1.240144
H  0.22878 -2.534638 0.983724
H  2.003348 -0.485738 -1.368049
H  0.213546 2.952292 0.441558
H  3.878806 -0.336514 0.196733
H  2.096169 3.111538 2.000447
H  1.587635 -3.122148 -2.888021
totalener: -1360.81961445 hartree
nucrepener: 2052.91520498 hartree
electener: -3413.73481943 hartree
oneelecener: -5937.85910671 hartree
twoeener: 2524.12428728 hartree
kineticenergy: 1356.13436415 hartree
xcener: -110.262242721764 hartree
chargesum: -0.0000000
charge: -0.079681 -0.392181 0.144659 -0.317758 -0.326797 0.416730 0.261255 -0.130727 -0.274418 -0.170635 -0.289958 -0.169754 -0.363618 -0.344778 0.018496 0.027798 -0.198924 -0.238195 -0.119255 -0.126503 0.031430 0.094920 0.093025 0.079443 0.084822 0.090048 0.083300 0.135943 0.138221 0.105360 0.111931 0.090155 0.108508 0.091952 0.079891 0.111021 0.098154 0.220658 0.150869 0.167705 0.123536 0.126315 0.122477 0.134562
qa: -0.0797 -0.3922 0.1447 -0.3178 -0.3268 0.4167 0.2613 -0.1307 -0.2744 -0.1706 -0.2900 -0.1698 -0.3636 -0.3448 0.0185 0.0278 -0.1989 -0.2382 -0.1193 -0.1265 0.0314 0.0949 0.0930 0.0794 0.0848 0.0900 0.0833 0.1359 0.1382 0.1054 0.1119 0.0902 0.1085 0.0920 0.0799 0.1110 0.0982 0.2207 0.1509 0.1677 0.1235 0.1263 0.1225 0.1346
va: 1.2264 2.0654 3.3098 2.8200 3.0267 3.7490 3.6646 3.9362 4.0053 3.8769 3.9328 3.8073 3.9554 3.9159 3.5462 4.0764 4.0093 3.9813 4.0376 4.0180 4.0481 3.9125 1.0089 1.0142 1.0092 1.0107 1.0148 1.0050 0.9939 1.0019 1.0290 1.0057 1.0150 0.9989 0.9981 1.0054 1.0067 1.0441 1.0179 0.9842 1.0088 1.0158 1.0136 1.0024
dispcorr: -0.027861623 hartree
energy: -1360.847476075020
dipole: -39.23153 37.76683 -1.46470 1.76683 -0.92947 0.83736 -7.51554 7.27734 -0.23820
magnitude: 1.70389 au
magnitude: 4.33095 debye
