program: Orca
programVersion: 4.2.1
elementType: Cl O N N N C C C C C C C C C C C C C C C C C H H H H H H H H H H H H H H H H H H H H H H
charge: 0
multiplicity: 1
keywords: wb97x-d3
keywords: def2-TZVPP
keywords: def2/J RIJCOSX GRIDX6 NOFINALGRIDX
keywords: grid4 nofinalgrid
keywords: scfconv7
keywords: smallprint printgap noloewdin
keywords: NOSOSCF
formula: C17H22ClN3O
InChI: InChI=1S/C17H22ClN3O/c1-16(2)8-7-14(9-13-3-5-15(18)6-4-13)17(16,22)10-21-12-19-11-20-21/h3-6,11-12,14,22H,7-10H2,1-2H3
44 atoms
Cl 4.390027 4.92924 0.780942
O  -1.222237 -1.59712 1.483368
N  -1.605688 -3.316953 -0.755769
N  -2.165609 -3.759879 -1.887288
N  -2.549873 -5.200514 -0.216435
C  -1.277321 -0.998959 0.211617
C  -2.6530 -0.342577 -0.136372
C  -0.306977 0.204841 0.085868
C  -2.285639 0.558413 -1.325601
C  -0.828373 1.013416 -1.108173
C  -0.827991 -2.098457 -0.759215
C  1.18813 -0.115349 0.040248
C  -3.138073 0.523626 1.03704
C  -3.788301 -1.301455 -0.481347
C  2.01894 1.125144 0.218018
C  -1.838348 -4.195341 0.230901
C  2.534214 1.815604 -0.873181
C  2.260138 1.639207 1.488907
C  3.262156 2.984469 -0.711103
C  2.986027 2.804314 1.672042
C  -2.724914 -4.885149 -1.514692
C  3.482852 3.474227 0.565057
H  -0.454491 0.802167 0.993049
H  -2.977078 1.397789 -1.41837
H  -2.372823 -0.006766 -2.256828
H  -0.227259 0.820481 -2.000828
H  -0.749865 2.0845 -0.922116
H  0.204125 -2.365164 -0.52431
H  -0.840158 -1.739528 -1.787059
H  1.451961 -0.590154 -0.908431
H  1.427954 -0.832582 0.830709
H  -3.428323 -0.079471 1.901377
H  -2.419376 1.275396 1.367179
H  -4.034679 1.066498 0.736337
H  -3.969763 -2.023429 0.31667
H  -4.712163 -0.735688 -0.619345
H  -3.613782 -1.852469 -1.402763
H  -1.504907 -0.958243 2.142984
H  -1.479497 -4.064861 1.237663
H  2.369549 1.435652 -1.874269
H  1.880671 1.115663 2.358918
H  3.657215 3.507515 -1.571014
H  3.169337 3.186367 2.666852
H  -3.275122 -5.502302 -2.207713
totalener: -1360.82070988 hartree
nucrepener: 1946.50473508 hartree
electener: -3307.32544496 hartree
oneelecener: -5724.81063584 hartree
twoeener: 2417.48519088 hartree
kineticenergy: 1356.13569939 hartree
xcener: -110.257193578988 hartree
chargesum: 0.0000000
charge: -0.081836 -0.377028 0.119378 -0.326329 -0.331647 0.487149 0.230214 -0.108714 -0.246109 -0.227731 -0.286423 -0.118287 -0.390143 -0.330417 0.051888 0.044017 -0.190719 -0.206706 -0.140200 -0.139149 0.068919 0.092436 0.071686 0.081894 0.094015 0.080614 0.096836 0.136408 0.131757 0.079217 0.107696 0.090621 0.114874 0.094409 0.100793 0.094750 0.096709 0.182526 0.148427 0.112861 0.116988 0.121315 0.121753 0.131286
qa: -0.0818 -0.3770 0.1194 -0.3263 -0.3316 0.4871 0.2302 -0.1087 -0.2461 -0.2277 -0.2864 -0.1183 -0.3901 -0.3304 0.0519 0.0440 -0.1907 -0.2067 -0.1402 -0.1391 0.0689 0.0924 0.0717 0.0819 0.0940 0.0806 0.0968 0.1364 0.1318 0.0792 0.1077 0.0906 0.1149 0.0944 0.1008 0.0948 0.0967 0.1825 0.1484 0.1129 0.1170 0.1213 0.1218 0.1313
va: 1.2251 2.0371 3.3410 2.8411 3.0679 3.6786 3.6967 3.9035 3.9808 3.9128 3.9449 3.7941 3.9343 3.9256 3.5836 4.0689 4.0044 4.0216 4.0372 4.0274 4.0347 3.9270 1.0194 1.0166 1.0093 1.0123 1.0089 0.9919 1.0032 1.0082 1.0282 1.0085 0.9930 1.0116 1.0081 1.0065 1.0249 1.0568 1.0187 1.0124 1.0120 1.0127 1.0124 1.0014
dispcorr: -0.024981018 hartree
energy: -1360.845690894264
dipole: -26.62351 26.60303 -0.02048 -10.49325 11.61400 1.12075 -3.32201 3.58597 0.26396
magnitude: 1.15160 au
magnitude: 2.92713 debye
