program: Orca
programVersion: 4.2.1
elementType: Cl O N N N C C C C C C C C C C C C C C C C C H H H H H H H H H H H H H H H H H H H H H H
charge: 0
multiplicity: 1
keywords: wb97x-d3
keywords: def2-TZVPP
keywords: def2/J RIJCOSX GRIDX6 NOFINALGRIDX
keywords: grid4 nofinalgrid
keywords: scfconv7
keywords: smallprint printgap noloewdin
keywords: NOSOSCF
formula: C17H22ClN3O
InChI: InChI=1S/C17H22ClN3O/c1-16(2)8-7-14(9-13-3-5-15(18)6-4-13)17(16,22)10-21-12-19-11-20-21/h3-6,11-12,14,22H,7-10H2,1-2H3
44 atoms
Cl 4.866038 3.499466 1.16369
O  -2.464098 -1.440262 1.107824
N  -1.110443 -2.983335 -0.693417
N  0.217985 -2.951184 -0.553037
N  -0.593555 -4.897407 0.201463
C  -2.084022 -0.784053 -0.083279
C  -3.262986 0.169076 -0.41992
C  -0.8741 0.156111 0.211356
C  -3.027967 1.294745 0.594514
C  -1.514184 1.507697 0.608281
C  -1.864946 -1.849799 -1.171845
C  0.186094 0.315909 -0.889641
C  -4.636435 -0.474797 -0.247871
C  -3.167473 0.713999 -1.848425
C  1.35752 1.123995 -0.404937
C  -1.577989 -4.148508 -0.227974
C  2.304636 0.538034 0.431749
C  1.528877 2.459277 -0.749493
C  3.382071 1.257826 0.918519
C  2.602249 3.197461 -0.272945
C  0.483708 -4.120497 -0.019721
C  3.522899 2.59064 0.563261
H  -0.339573 -0.262624 1.071418
H  -3.383885 0.982245 1.577637
H  -3.575261 2.202625 0.331601
H  -1.236473 2.278066 -0.114679
H  -1.155596 1.864246 1.573184
H  -1.368456 -1.450075 -2.054125
H  -2.833383 -2.236987 -1.493862
H  -0.242775 0.792882 -1.774252
H  0.551567 -0.663903 -1.196829
H  -4.797901 -0.839684 0.763779
H  -5.414932 0.259007 -0.465529
H  -4.791792 -1.309212 -0.936421
H  -3.306474 -0.0674 -2.598235
H  -3.958703 1.447517 -2.011142
H  -2.224416 1.214171 -2.065421
H  -1.681049 -1.78688 1.543919
H  -2.626658 -4.400949 -0.224047
H  2.202909 -0.508177 0.696877
H  0.816679 2.93886 -1.410185
H  4.111165 0.786796 1.563222
H  2.721949 4.23483 -0.553154
H  1.492627 -4.423474 0.212203
totalener: -1360.82263180 hartree
nucrepener: 1976.00899553 hartree
electener: -3336.83162733 hartree
oneelecener: -5784.09260269 hartree
twoeener: 2447.26097536 hartree
kineticenergy: 1356.15360920 hartree
xcener: -110.259106458522 hartree
chargesum: -0.0000000
charge: -0.086735 -0.357499 0.140529 -0.353397 -0.328389 0.384145 0.215484 -0.084815 -0.248017 -0.174833 -0.231244 -0.174833 -0.304670 -0.363416 0.058130 0.040215 -0.195150 -0.189975 -0.141561 -0.141969 0.066008 0.094347 0.067984 0.092443 0.077577 0.078428 0.088563 0.128123 0.119993 0.115076 0.121293 0.106090 0.093491 0.073424 0.091822 0.097589 0.100349 0.178664 0.141459 0.121736 0.111661 0.119892 0.118646 0.133342
qa: -0.0867 -0.3575 0.1405 -0.3534 -0.3284 0.3841 0.2155 -0.0848 -0.2480 -0.1748 -0.2312 -0.1748 -0.3047 -0.3634 0.0581 0.0402 -0.1952 -0.1900 -0.1416 -0.1420 0.0660 0.0943 0.0680 0.0924 0.0776 0.0784 0.0886 0.1281 0.1200 0.1151 0.1213 0.1061 0.0935 0.0734 0.0918 0.0976 0.1003 0.1787 0.1415 0.1217 0.1117 0.1199 0.1186 0.1333
va: 1.2197 2.1042 3.2753 2.8341 3.0629 3.7204 3.8024 3.9203 3.9910 3.9279 3.8867 3.7195 3.9328 3.9412 3.5869 4.0942 4.0102 4.0167 4.0372 4.0477 4.0398 3.9178 1.0299 1.0236 1.0191 1.0113 1.0157 0.9969 1.0042 0.9997 1.0466 1.0197 1.0026 1.0089 1.0009 1.0101 1.0090 1.0558 1.0058 1.0161 1.0121 1.0132 1.0137 1.0010
dispcorr: -0.025368968 hartree
energy: -1360.848000766676
dipole: -35.77048 34.63855 -1.13193 -3.65635 4.04581 0.38947 -8.68305 8.03600 -0.64704
magnitude: 1.36074 au
magnitude: 3.45873 debye
