program: Orca
programVersion: 4.2.1
elementType: Cl O N N N C C C C C C C C C C C C C C C C C H H H H H H H H H H H H H H H H H H H H H H
charge: 0
multiplicity: 1
keywords: wb97x-d3
keywords: def2-TZVPP
keywords: def2/J RIJCOSX GRIDX6 NOFINALGRIDX
keywords: grid4 nofinalgrid
keywords: scfconv7
keywords: smallprint printgap noloewdin
keywords: NOSOSCF
formula: C17H22ClN3O
InChI: InChI=1S/C17H22ClN3O/c1-16(2)8-7-14(9-13-3-5-15(18)6-4-13)17(16,22)10-21-12-19-11-20-21/h3-6,11-12,14,22H,7-10H2,1-2H3
44 atoms
Cl 5.045295 1.424718 1.762231
O  -0.638959 -0.520003 1.052386
N  -0.750275 -1.93205 -1.54025
N  -0.160143 -2.691494 -0.614978
N  -0.657695 -3.923882 -2.41105
C  -1.508211 -0.107584 0.040772
C  -2.997851 -0.538041 0.27597
C  -1.615843 1.436492 0.084347
C  -3.775526 0.461973 -0.58998
C  -2.967942 1.771488 -0.566259
C  -0.947296 -0.510747 -1.339426
C  -0.473991 2.268698 -0.504554
C  -3.362278 -0.334629 1.752941
C  -3.353832 -1.979621 -0.077831
C  0.897232 2.031649 0.071768
C  -1.035612 -2.684068 -2.608111
C  1.129993 2.088717 1.443291
C  1.982881 1.786666 -0.760218
C  2.39647 1.906684 1.967355
C  3.261336 1.597013 -0.254744
C  -0.130909 -3.879275 -1.175311
C  3.459812 1.657826 1.112094
H  -1.670711 1.684594 1.147446
H  -4.797466 0.591383 -0.229058
H  -3.86723 0.08686 -1.613485
H  -2.827903 2.160517 -1.578335
H  -3.479694 2.559269 -0.012135
H  0.024923 -0.032414 -1.46706
H  -1.593648 -0.163704 -2.147153
H  -0.740515 3.320544 -0.352928
H  -0.43546 2.146977 -1.591587
H  -3.219442 0.688761 2.10009
H  -4.416714 -0.575516 1.89969
H  -2.77824 -0.98438 2.402587
H  -2.733831 -2.699422 0.458019
H  -4.389511 -2.177794 0.205372
H  -3.280045 -2.191461 -1.143917
H  -0.326245 -1.417259 0.8623
H  -1.515649 -2.294077 -3.49282
H  0.309537 2.272692 2.124614
H  1.837169 1.74758 -1.834004
H  2.557887 1.9518 3.03548
H  4.091666 1.404785 -0.920198
H  0.288865 -4.73631 -0.672637
totalener: -1360.82056947 hartree
nucrepener: 2016.16816764 hartree
electener: -3376.98873711 hartree
oneelecener: -5864.66404610 hartree
twoeener: 2487.67530899 hartree
kineticenergy: 1356.13603878 hartree
xcener: -110.263121031181 hartree
chargesum: -0.0000000
charge: -0.088503 -0.380961 0.140341 -0.352256 -0.325648 0.471246 0.243213 -0.099202 -0.243213 -0.215306 -0.293952 -0.157838 -0.337312 -0.340324 0.099429 0.033176 -0.193498 -0.198831 -0.115351 -0.123978 0.082320 0.075550 0.079945 0.082486 0.080375 0.079077 0.089980 0.131793 0.114141 0.106941 0.071823 0.089329 0.085114 0.104715 0.104071 0.098375 0.077684 0.197365 0.143708 0.101615 0.110186 0.116505 0.117995 0.137678
qa: -0.0885 -0.3810 0.1403 -0.3523 -0.3256 0.4712 0.2432 -0.0992 -0.2432 -0.2153 -0.2940 -0.1578 -0.3373 -0.3403 0.0994 0.0332 -0.1935 -0.1988 -0.1154 -0.1240 0.0823 0.0756 0.0799 0.0825 0.0804 0.0791 0.0900 0.1318 0.1141 0.1069 0.0718 0.0893 0.0851 0.1047 0.1041 0.0984 0.0777 0.1974 0.1437 0.1016 0.1102 0.1165 0.1180 0.1377
va: 1.2179 2.0655 3.3340 2.8661 3.0725 3.7085 3.7500 3.8932 3.9458 3.9202 4.0136 3.8505 3.9563 3.9388 3.6083 4.0702 4.0401 4.0056 4.0193 4.0367 4.0176 3.9296 1.0145 1.0210 1.0076 1.0099 1.0127 1.0074 0.9886 0.9961 1.0041 1.0004 1.0063 1.0199 1.0126 1.0091 1.0040 1.0914 1.0002 1.0144 1.0092 1.0127 1.0129 0.9997
dispcorr: -0.026054574 hartree
energy: -1360.846624044037
dipole: -38.00800 36.72000 -1.28800 0.58996 0.17551 0.76547 -4.95766 4.25712 -0.70054
magnitude: 1.65398 au
magnitude: 4.20407 debye
