program: Orca
programVersion: 4.2.1
elementType: Cl O N N N C C C C C C C C C C C C C C C C C H H H H H H H H H H H H H H H H H H H H H H
charge: 0
multiplicity: 1
keywords: wb97x-d3
keywords: def2-TZVPP
keywords: def2/J RIJCOSX GRIDX6 NOFINALGRIDX
keywords: grid4 nofinalgrid
keywords: scfconv7
keywords: smallprint printgap noloewdin
keywords: NOSOSCF
formula: C17H22ClN3O
InChI: InChI=1S/C17H22ClN3O/c1-16(2)8-7-14(9-13-3-5-15(18)6-4-13)17(16,22)10-21-12-19-11-20-21/h3-6,11-12,14,22H,7-10H2,1-2H3
44 atoms
Cl 4.592121 4.704693 1.063839
O  -1.581482 -1.494222 1.58218
N  -1.547255 -3.358441 -0.702255
N  -2.152541 -3.957384 0.327163
N  -2.76785 -4.923438 -1.593016
C  -1.277246 -1.075811 0.272774
C  -2.527083 -0.424825 -0.405524
C  -0.268095 0.107556 0.459607
C  -2.543102 0.947239 0.281446
C  -1.089337 1.397634 0.279695
C  -0.645823 -2.244511 -0.498319
C  0.999201 0.100875 -0.404861
C  -3.84945 -1.152113 -0.177432
C  -2.32681 -0.244036 -1.914145
C  1.909319 1.246938 -0.056333
C  -1.924523 -3.951314 -1.840442
C  2.07432 2.330205 -0.910578
C  2.597994 1.2583 1.153983
C  2.895621 3.397056 -0.576693
C  3.421961 2.313347 1.505665
C  -2.877182 -4.886275 -0.25329
C  3.565293 3.382273 0.634164
H  0.057203 0.031981 1.499761
H  -2.905991 0.836738 1.305802
H  -3.209832 1.650845 -0.222206
H  -0.843538 1.882034 -0.669466
H  -0.869847 2.130016 1.056046
H  0.221196 -2.6106 0.056085
H  -0.299954 -1.937244 -1.483963
H  0.74221 0.159716 -1.466715
H  1.550396 -0.833929 -0.269423
H  -4.669981 -0.529052 -0.539384
H  -3.918084 -2.099676 -0.712223
H  -4.035545 -1.339352 0.879228
H  -1.378523 0.227584 -2.175959
H  -2.383389 -1.193501 -2.449299
H  -3.11815 0.387979 -2.320944
H  -2.032109 -2.350417 1.545328
H  -1.563099 -3.648863 -2.811487
H  1.555349 2.346642 -1.861396
H  2.493597 0.425357 1.839548
H  3.013148 4.231422 -1.254224
H  3.951346 2.305229 2.448437
H  -3.502331 -5.558098 0.313291
totalener: -1360.82513700 hartree
nucrepener: 1955.60631823 hartree
electener: -3316.43145523 hartree
oneelecener: -5743.08058360 hartree
twoeener: 2426.64912837 hartree
kineticenergy: 1356.14071437 hartree
xcener: -110.260556640775 hartree
chargesum: 0.0000000
charge: -0.083068 -0.373100 0.131232 -0.343636 -0.322539 0.399494 0.210945 -0.059463 -0.219574 -0.185840 -0.258252 -0.146273 -0.345632 -0.375295 0.023942 0.032507 -0.155438 -0.188179 -0.156875 -0.147304 0.077989 0.104561 0.093290 0.094074 0.075565 0.074202 0.090906 0.135581 0.110713 0.089888 0.100953 0.097233 0.093604 0.098387 0.093745 0.087811 0.100036 0.198111 0.142550 0.109871 0.117927 0.119210 0.121470 0.134673
qa: -0.0831 -0.3731 0.1312 -0.3436 -0.3225 0.3995 0.2109 -0.0595 -0.2196 -0.1858 -0.2583 -0.1463 -0.3456 -0.3753 0.0239 0.0325 -0.1554 -0.1882 -0.1569 -0.1473 0.0780 0.1046 0.0933 0.0941 0.0756 0.0742 0.0909 0.1356 0.1107 0.0899 0.1010 0.0972 0.0936 0.0984 0.0937 0.0878 0.1000 0.1981 0.1425 0.1099 0.1179 0.1192 0.1215 0.1347
va: 1.2237 2.0936 3.3095 2.8561 3.0581 3.7932 3.7905 3.6477 3.9463 3.9343 3.9407 3.7996 3.9296 3.9360 3.6095 4.0737 3.9785 4.0145 4.0617 4.0435 4.0242 3.9170 1.0552 1.0270 1.0198 1.0105 1.0160 1.0073 0.9861 1.0036 1.0130 1.0050 1.0002 1.0206 1.0061 1.0069 1.0124 1.0849 1.0005 1.0129 1.0111 1.0138 1.0132 1.0016
dispcorr: -0.025488106 hartree
energy: -1360.850625108040
dipole: -26.25429 26.27782 0.02353 -11.30748 11.34370 0.03622 -8.17786 7.44560 -0.73226
magnitude: 0.73353 au
magnitude: 1.86450 debye
