program: Orca
programVersion: 4.2.1
elementType: Cl O N N N C C C C C C C C C C C C C C C C C H H H H H H H H H H H H H H H H H H H H H H
charge: 0
multiplicity: 1
keywords: wb97x-d3
keywords: def2-TZVPP
keywords: def2/J RIJCOSX GRIDX6 NOFINALGRIDX
keywords: grid4 nofinalgrid
keywords: scfconv7
keywords: smallprint printgap noloewdin
keywords: NOSOSCF
formula: C17H22ClN3O
InChI: InChI=1S/C17H22ClN3O/c1-16(2)8-7-14(9-13-3-5-15(18)6-4-13)17(16,22)10-21-12-19-11-20-21/h3-6,11-12,14,22H,7-10H2,1-2H3
44 atoms
Cl 4.987753 2.957904 1.35475
O  -2.576568 -1.654348 0.977085
N  -1.02304 -2.753859 -0.995155
N  0.253539 -2.597595 -1.360834
N  -0.008312 -4.530726 -0.261095
C  -2.20782 -0.787729 -0.08008
C  -3.323099 0.291912 -0.330718
C  -0.959601 0.017339 0.344972
C  -2.847908 1.514802 0.504631
C  -1.580466 1.086407 1.25026
C  -2.011633 -1.737636 -1.261928
C  -0.144509 0.658492 -0.791499
C  -4.695693 -0.195728 0.136653
C  -3.461231 0.6848 -1.806519
C  1.138482 1.24979 -0.278374
C  -1.159074 -3.910023 -0.334187
C  1.289634 2.61831 -0.088421
C  2.21098 0.420528 0.041321
C  2.467312 3.153422 0.412827
C  3.394012 0.936026 0.542327
C  0.823099 -3.685419 -0.899811
C  3.514048 2.304942 0.728504
H  -0.28077 -0.643016 0.893655
H  -3.624147 1.864082 1.187593
H  -2.626217 2.358873 -0.153223
H  -0.899772 1.915438 1.445414
H  -1.825201 0.681559 2.238096
H  -1.703861 -1.215908 -2.164067
H  -2.958956 -2.235112 -1.48316
H  -0.719507 1.438119 -1.294931
H  0.10134 -0.094556 -1.540672
H  -4.738776 -0.377646 1.209089
H  -5.449936 0.558262 -0.096232
H  -4.993779 -1.118889 -0.363861
H  -3.861095 -0.128512 -2.415026
H  -4.159674 1.51828 -1.89746
H  -2.52318 1.007111 -2.258211
H  -2.394891 -1.237633 1.822689
H  -2.09901 -4.252474 0.066791
H  0.475992 3.288037 -0.341696
H  2.119848 -0.647989 -0.11557
H  2.569159 4.220653 0.553307
H  4.219822 0.280504 0.782174
H  1.874934 -3.879566 -1.040468
totalener: -1360.82048495 hartree
nucrepener: 1989.05962164 hartree
electener: -3349.88010659 hartree
oneelecener: -5810.24426785 hartree
twoeener: 2460.36416126 hartree
kineticenergy: 1356.14602326 hartree
xcener: -110.258013862209 hartree
chargesum: -0.0000000
charge: -0.085923 -0.372352 0.142085 -0.358231 -0.335674 0.466925 0.000167 0.042180 -0.132853 -0.285868 -0.237768 -0.197307 -0.287145 -0.362850 0.063468 0.054360 -0.235298 -0.205945 -0.118339 -0.135895 0.069053 0.088318 0.102574 0.078121 0.080579 0.096749 0.080155 0.134251 0.125011 0.096805 0.123470 0.084166 0.096038 0.085027 0.094159 0.101965 0.106144 0.178926 0.142584 0.118196 0.127817 0.119117 0.119173 0.133865
qa: -0.0859 -0.3724 0.1421 -0.3582 -0.3357 0.4669 0.0002 0.0422 -0.1329 -0.2859 -0.2378 -0.1973 -0.2871 -0.3629 0.0635 0.0544 -0.2353 -0.2059 -0.1183 -0.1359 0.0691 0.0883 0.1026 0.0781 0.0806 0.0967 0.0802 0.1343 0.1250 0.0968 0.1235 0.0842 0.0960 0.0850 0.0942 0.1020 0.1061 0.1789 0.1426 0.1182 0.1278 0.1191 0.1192 0.1339
va: 1.2206 2.0747 3.2905 2.8214 3.0738 3.6457 3.9845 3.8242 3.8017 4.0241 3.9059 3.7651 3.9647 3.9430 3.5801 4.0889 3.9982 4.0265 4.0210 4.0414 4.0302 3.9159 1.0166 1.0185 1.0069 1.0242 1.0149 0.9978 1.0029 1.0145 1.0376 1.0165 1.0010 1.0115 1.0004 1.0055 0.9992 1.0647 1.0122 1.0085 1.0168 1.0130 1.0141 1.0001
dispcorr: -0.025790081 hartree
energy: -1360.846275029579
dipole: -38.17720 36.54726 -1.62994 -0.88078 1.77508 0.89430 -6.42014 6.28721 -0.13294
magnitude: 1.86391 au
magnitude: 4.73767 debye
