program: Orca
programVersion: 4.2.1
elementType: Cl O N N N C C C C C C C C C C C C C C C C C H H H H H H H H H H H H H H H H H H H H H H
charge: 0
multiplicity: 1
keywords: wb97x-d3
keywords: def2-TZVPP
keywords: def2/J RIJCOSX GRIDX6 NOFINALGRIDX
keywords: grid4 nofinalgrid
keywords: scfconv7
keywords: smallprint printgap noloewdin
keywords: NOSOSCF
formula: C17H22ClN3O
InChI: InChI=1S/C17H22ClN3O/c1-16(2)8-7-14(9-13-3-5-15(18)6-4-13)17(16,22)10-21-12-19-11-20-21/h3-6,11-12,14,22H,7-10H2,1-2H3
44 atoms
Cl 5.016518 3.936364 1.676943
O  -1.552562 -0.599586 -1.811549
N  -1.615878 -3.263905 -0.696312
N  -2.521438 -3.939966 0.013997
N  -2.431695 -4.727507 -2.078218
C  -1.418228 -0.773516 -0.417219
C  -2.731992 -0.374924 0.320876
C  -0.391285 0.270609 0.079314
C  -2.674952 1.157027 0.223435
C  -1.205083 1.53667 0.418952
C  -0.852946 -2.173815 -0.130045
C  0.765071 0.527068 -0.894316
C  -2.699021 -0.805241 1.789655
C  -4.019688 -0.90557 -0.306789
C  1.83437 1.381121 -0.271845
C  -1.573043 -3.744214 -1.941958
C  1.942801 2.737305 -0.564674
C  2.737886 0.83423 0.637838
C  2.914015 3.531372 0.029561
C  3.71694 1.607995 1.24017
C  -2.985925 -4.804482 -0.853366
C  3.794749 2.957335 0.930383
H  0.044755 -0.124148 1.00316
H  -3.337107 1.630388 0.951496
H  -3.017397 1.476033 -0.763985
H  -0.929315 2.377374 -0.219843
H  -1.006488 1.855059 1.443117
H  -0.761842 -2.358119 0.937905
H  0.152592 -2.237086 -0.549518
H  0.388673 1.012728 -1.795765
H  1.210899 -0.420532 -1.210851
H  -2.770833 -1.888412 1.898413
H  -1.799932 -0.477091 2.31472
H  -3.550898 -0.373695 2.318741
H  -4.155198 -0.589748 -1.344006
H  -4.09692 -1.99182 -0.263756
H  -4.878077 -0.507209 0.238582
H  -2.351124 -1.040118 -2.119683
H  -0.899835 -3.367589 -2.696225
H  1.263399 3.190557 -1.276451
H  2.685389 -0.220947 0.880635
H  2.980703 4.583333 -0.213835
H  4.411442 1.161698 1.939266
H  -3.748443 -5.52109 -0.589873
elementType: Cl O N C H
totalener: -1360.85390108 hartree
nucrepener: 1946.50056727 hartree
electener: -3307.35446836 hartree
oneelecener: -5724.91967948 hartree
twoeener: 2417.56521112 hartree
cpcmener: -0.02557785 hartree
kineticenergy: 1356.12877485 hartree
xcener: -110.256908231194 hartree
chargesum: 0.0000000
charge: -0.105749 -0.424275 0.139822 -0.378411 -0.410217 0.320434 0.254920 -0.047280 -0.225191 -0.210759 -0.222157 -0.118570 -0.373203 -0.361077 0.046901 0.042116 -0.207582 -0.228766 -0.159172 -0.157476 0.077091 0.095489 0.095999 0.085778 0.082935 0.078023 0.099654 0.127219 0.148247 0.090583 0.104711 0.097062 0.107491 0.097679 0.091435 0.114492 0.104687 0.218211 0.180072 0.141654 0.139638 0.142396 0.142790 0.162359
qa: -0.1057 -0.4243 0.1398 -0.3784 -0.4102 0.3204 0.2549 -0.0473 -0.2252 -0.2108 -0.2222 -0.1186 -0.3732 -0.3611 0.0469 0.0421 -0.2076 -0.2288 -0.1592 -0.1575 0.0771 0.0955 0.0960 0.0858 0.0829 0.0780 0.0997 0.1272 0.1482 0.0906 0.1047 0.0971 0.1075 0.0977 0.0914 0.1145 0.1047 0.2182 0.1801 0.1417 0.1396 0.1424 0.1428 0.1624
va: 1.1998 2.0332 3.3213 2.8452 3.0359 3.8834 3.7168 3.7541 3.9716 3.9446 3.9227 3.8182 3.9417 3.9055 3.4956 4.0623 3.9779 3.9979 3.9988 3.9964 4.0114 3.8258 1.0116 1.0168 1.0222 1.0170 1.0028 1.0078 0.9939 1.0286 1.0168 1.0171 0.9973 1.0071 1.0100 1.0123 1.0022 1.0282 0.9997 1.0047 1.0054 1.0061 1.0057 0.9943
dispcorr: -0.025056296 hartree
energy: -1360.878957379606
dipole: -29.61213 29.29129 -0.32084 -8.62040 8.98677 0.36637 -1.23394 1.44228 0.20834
magnitude: 0.52969 au
magnitude: 1.34636 debye
