program: Orca
programVersion: 4.2.1
elementType: Cl O N N N C C C C C C C C C C C C C C C C C H H H H H H H H H H H H H H H H H H H H H H
charge: 0
multiplicity: 1
keywords: wb97x-d3
keywords: def2-TZVPP
keywords: def2/J RIJCOSX GRIDX6 NOFINALGRIDX
keywords: grid4 nofinalgrid
keywords: scfconv7
keywords: smallprint printgap noloewdin
keywords: NOSOSCF
formula: C17H22ClN3O
InChI: InChI=1S/C17H22ClN3O/c1-16(2)8-7-14(9-13-3-5-15(18)6-4-13)17(16,22)10-21-12-19-11-20-21/h3-6,11-12,14,22H,7-10H2,1-2H3
44 atoms
Cl 5.013779 2.645496 1.752921
O  -2.301833 -0.396246 -1.858291
N  -1.128012 -2.708078 -0.606628
N  -0.015683 -2.880801 0.112173
N  0.237178 -3.753135 -1.932532
C  -2.301303 -0.515355 -0.45231
C  -3.533731 0.213526 0.16763
C  -1.081983 0.282848 0.079935
C  -3.098408 1.677699 0.054655
C  -1.628646 1.677503 0.468608
C  -2.269017 -2.001027 -0.070747
C  0.099588 0.373658 -0.894865
C  -3.724301 -0.154276 1.643244
C  -4.841558 -0.057495 -0.569464
C  1.321918 0.950784 -0.235868
C  -0.961482 -3.227916 -1.823493
C  1.75087 2.246284 -0.506542
C  2.058937 0.193977 0.674522
C  2.879829 2.778539 0.101947
C  3.19015 0.704659 1.290301
C  0.773965 -3.511428 -0.721661
C  3.59297 1.99881 0.995908
H  -0.726781 -0.22479 0.981194
H  -3.715432 2.338624 0.667381
H  -3.200347 2.015826 -0.979681
H  -1.076216 2.484571 -0.015682
H  -1.526208 1.842948 1.542274
H  -3.170027 -2.503718 -0.431167
H  -2.236557 -2.133477 1.007795
H  -0.174552 0.99188 -1.7515
H  0.353135 -0.609786 -1.293902
H  -4.111813 -1.166836 1.770604
H  -2.807488 -0.0779 2.230691
H  -4.452575 0.519212 2.099349
H  -5.103477 -1.118939 -0.579954
H  -5.663791 0.462687 -0.074047
H  -4.829421 0.30008 -1.600812
H  -3.110752 -0.783545 -2.210986
H  -1.728857 -3.217892 -2.581044
H  1.202746 2.857877 -1.213271
H  1.748641 -0.819043 0.904436
H  3.196684 3.787343 -0.12663
H  3.752469 0.097138 1.986827
H  1.771797 -3.812803 -0.442304
elementType: Cl O N C H
totalener: -1360.85424425 hartree
nucrepener: 1991.83635420 hartree
electener: -3352.69059845 hartree
oneelecener: -5816.31446238 hartree
twoeener: 2463.62386394 hartree
cpcmener: -0.02839348 hartree
kineticenergy: 1356.12668817 hartree
xcener: -110.256606110918 hartree
chargesum: -0.0000000
charge: -0.107672 -0.405001 0.130621 -0.367817 -0.407709 0.331271 0.235211 -0.057229 -0.235289 -0.189687 -0.189572 -0.126700 -0.373506 -0.342048 0.068429 0.061498 -0.217563 -0.245676 -0.154280 -0.167560 0.067814 0.098846 0.086293 0.084312 0.082065 0.076185 0.099131 0.137264 0.119169 0.100020 0.108644 0.099239 0.106102 0.099587 0.106433 0.101575 0.089931 0.206791 0.165174 0.141061 0.143616 0.141613 0.140051 0.159362
qa: -0.1077 -0.4050 0.1306 -0.3678 -0.4077 0.3313 0.2352 -0.0572 -0.2353 -0.1897 -0.1896 -0.1267 -0.3735 -0.3420 0.0684 0.0615 -0.2176 -0.2457 -0.1543 -0.1676 0.0678 0.0988 0.0863 0.0843 0.0821 0.0762 0.0991 0.1373 0.1192 0.1000 0.1086 0.0992 0.1061 0.0996 0.1064 0.1016 0.0899 0.2068 0.1652 0.1411 0.1436 0.1416 0.1401 0.1594
va: 1.1972 2.0505 3.3403 2.8243 3.0382 3.8998 3.7651 3.7478 3.9606 3.9311 3.9269 3.7904 3.9569 3.9218 3.4535 4.0727 3.9989 3.9866 3.9952 4.0460 4.0199 3.8106 1.0254 1.0185 1.0257 1.0202 1.0011 0.9955 1.0117 1.0275 1.0121 0.9974 0.9968 1.0059 1.0009 1.0018 1.0121 1.0262 1.0027 1.0054 1.0155 1.0063 1.0083 0.9972
dispcorr: -0.025852514 hartree
energy: -1360.880096766898
dipole: -40.11448 36.88689 -3.22759 -2.54207 2.61020 0.06813 -2.54155 2.62414 0.08259
magnitude: 3.22937 au
magnitude: 8.20840 debye
