program: Orca
programVersion: 4.2.1
elementType: Cl O N N N C C C C C C C C C C C C C C C C C H H H H H H H H H H H H H H H H H H H H H H
charge: 0
multiplicity: 1
keywords: wb97x-d3
keywords: def2-TZVPP
keywords: def2/J RIJCOSX GRIDX6 NOFINALGRIDX
keywords: grid4 nofinalgrid
keywords: scfconv7
keywords: smallprint printgap noloewdin
keywords: NOSOSCF
formula: C17H22ClN3O
InChI: InChI=1S/C17H22ClN3O/c1-16(2)8-7-14(9-13-3-5-15(18)6-4-13)17(16,22)10-21-12-19-11-20-21/h3-6,11-12,14,22H,7-10H2,1-2H3
44 atoms
Cl 5.036599 2.855508 1.328897
O  -2.334401 -0.79824 -1.789524
N  -1.111073 -2.745828 -0.170857
N  -0.011374 -2.79398 0.585677
N  0.271672 -4.002596 -1.275424
C  -2.299268 -0.570511 -0.395476
C  -3.549573 0.236376 0.069787
C  -1.093912 0.32537 0.020056
C  -3.123388 1.667523 -0.280008
C  -1.664145 1.75705 0.165766
C  -2.263322 -1.966416 0.223356
C  0.095654 0.264496 -0.946984
C  -3.763108 0.129094 1.584073
C  -4.836158 -0.176005 -0.635487
C  1.320616 0.926498 -0.379041
C  -0.927544 -3.467994 -1.277336
C  2.039648 0.315559 0.647769
C  1.774465 2.152045 -0.855789
C  3.177647 0.899925 1.179031
C  2.911456 2.756157 -0.335528
C  0.789977 -3.557752 -0.114796
C  3.606364 2.120624 0.678843
H  -0.741326 -0.018952 0.996204
H  -3.762626 2.415458 0.193531
H  -3.207846 1.838394 -1.359419
H  -1.105435 2.48436 -0.426048
H  -1.598686 2.094576 1.201073
H  -3.155974 -2.525083 -0.064044
H  -2.245143 -1.912512 1.308397
H  -0.162615 0.749087 -1.891748
H  0.341341 -0.770037 -1.191027
H  -4.160253 -0.845077 1.875455
H  -2.855711 0.299085 2.166785
H  -4.493296 0.874241 1.906274
H  -5.084943 -1.225398 -0.460242
H  -5.674557 0.414668 -0.260085
H  -4.792775 -0.022948 -1.713824
H  -2.361342 0.041547 -2.259798
H  -1.682196 -3.583537 -2.038733
H  1.709631 -0.640541 1.037637
H  1.240649 2.648552 -1.657416
H  3.726397 0.405012 1.969245
H  3.248656 3.707698 -0.724351
H  1.782502 -3.806751 0.227936
elementType: Cl O N C H
totalener: -1360.85363827 hartree
nucrepener: 1991.35085812 hartree
electener: -3352.20449639 hartree
oneelecener: -5815.09461595 hartree
twoeener: 2462.89011956 hartree
cpcmener: -0.02627148 hartree
kineticenergy: 1356.12487894 hartree
xcener: -110.256471786535 hartree
chargesum: 0.0000000
charge: -0.106800 -0.421138 0.119965 -0.370526 -0.408832 0.384347 0.233417 -0.112908 -0.261820 -0.165844 -0.174886 -0.127369 -0.374569 -0.321913 0.074823 0.067640 -0.247592 -0.219796 -0.164016 -0.150393 0.069069 0.094171 0.082168 0.083394 0.081876 0.078072 0.100968 0.136834 0.126167 0.099868 0.110232 0.099291 0.105175 0.099514 0.091100 0.103017 0.087518 0.208972 0.167302 0.144402 0.138734 0.139741 0.141076 0.159548
qa: -0.1068 -0.4211 0.1200 -0.3705 -0.4088 0.3843 0.2334 -0.1129 -0.2618 -0.1658 -0.1749 -0.1274 -0.3746 -0.3219 0.0748 0.0676 -0.2476 -0.2198 -0.1640 -0.1504 0.0691 0.0942 0.0822 0.0834 0.0819 0.0781 0.1010 0.1368 0.1262 0.0999 0.1102 0.0993 0.1052 0.0995 0.0911 0.1030 0.0875 0.2090 0.1673 0.1444 0.1387 0.1397 0.1411 0.1595
va: 1.1979 2.0316 3.3487 2.8243 3.0380 3.8285 3.7435 3.8730 3.9784 3.8981 3.8827 3.7994 3.9567 3.9418 3.4729 4.0598 3.9916 4.0043 4.0459 3.9950 4.0179 3.8127 1.0255 1.0197 1.0130 1.0225 1.0008 0.9997 1.0112 1.0178 1.0118 0.9978 0.9968 1.0061 1.0052 1.0011 1.0170 1.0312 1.0058 1.0164 1.0061 1.0083 1.0064 0.9969
dispcorr: -0.025862410 hartree
energy: -1360.879500677170
dipole: -39.68345 37.07900 -2.60445 -1.63273 2.67778 1.04505 -2.75155 2.68161 -0.06994
magnitude: 2.80716 au
magnitude: 7.13524 debye
