program: Orca
programVersion: 4.2.1
elementType: Cl O N N N C C C C C C C C C C C C C C C C C H H H H H H H H H H H H H H H H H H H H H H
charge: 0
multiplicity: 1
keywords: wb97x-d3
keywords: def2-TZVPP
keywords: def2/J RIJCOSX GRIDX6 NOFINALGRIDX
keywords: grid4 nofinalgrid
keywords: scfconv7
keywords: smallprint printgap noloewdin
keywords: NOSOSCF
formula: C17H22ClN3O
InChI: InChI=1S/C17H22ClN3O/c1-16(2)8-7-14(9-13-3-5-15(18)6-4-13)17(16,22)10-21-12-19-11-20-21/h3-6,11-12,14,22H,7-10H2,1-2H3
44 atoms
Cl 5.195225 0.969161 0.523556
O  -1.322882 0.324019 -1.489952
N  -0.48911 -2.162786 -0.130674
N  -0.300616 -2.304078 -1.445196
N  -0.488297 -4.305728 -0.474996
C  -1.605886 0.072008 -0.132609
C  -3.079723 -0.423277 0.031306
C  -1.600444 1.440117 0.603185
C  -3.847398 0.881903 -0.210757
C  -3.056472 1.95658 0.532236
C  -0.539833 -0.849205 0.478074
C  -0.61739 2.486629 0.064205
C  -3.354381 -0.921975 1.452913
C  -3.521265 -1.49756 -0.957945
C  0.836357 2.120123 0.164447
C  -0.597092 -3.363945 0.435175
C  1.561625 1.704518 -0.949138
C  1.494234 2.173179 1.391876
C  2.898938 1.349852 -0.849074
C  2.829512 1.820119 1.51409
C  -0.311416 -3.604927 -1.608195
C  3.52242 1.408206 0.386568
H  -1.341052 1.257047 1.650884
H  -4.887013 0.811299 0.117172
H  -3.867593 1.100241 -1.281346
H  -3.113631 2.920927 0.023344
H  -3.452688 2.117143 1.536567
H  -0.714611 -0.995596 1.54195
H  0.446236 -0.395993 0.374303
H  -0.784821 3.400062 0.642353
H  -0.869019 2.732306 -0.968301
H  -4.426855 -1.073418 1.592735
H  -2.876667 -1.882658 1.655989
H  -3.027897 -0.22662 2.228482
H  -3.066234 -2.470958 -0.769689
H  -4.601408 -1.642689 -0.877855
H  -3.316108 -1.220104 -1.992154
H  -1.047013 -0.50215 -1.914494
H  -0.748001 -3.504836 1.494101
H  1.075635 1.647778 -1.914145
H  0.959498 2.501554 2.27583
H  3.444198 1.030051 -1.727075
H  3.32252 1.872902 2.475682
H  -0.183714 -4.060359 -2.577897
elementType: Cl O N C H
totalener: -1360.85409467 hartree
nucrepener: 2031.57552506 hartree
electener: -3392.42961973 hartree
oneelecener: -5895.54453979 hartree
twoeener: 2503.11492005 hartree
cpcmener: -0.02209472 hartree
kineticenergy: 1356.13635176 hartree
xcener: -110.263596399350 hartree
chargesum: -0.0000000
charge: -0.106277 -0.443675 0.139143 -0.374549 -0.404414 0.347451 0.291436 -0.058016 -0.262359 -0.160868 -0.239484 -0.111107 -0.376312 -0.362768 0.046524 0.055860 -0.232704 -0.231103 -0.134677 -0.139499 0.080419 0.084420 0.083671 0.081263 0.087790 0.073658 0.090239 0.125732 0.151026 0.108050 0.091106 0.101522 0.095136 0.106654 0.092665 0.104878 0.094593 0.216204 0.175512 0.129062 0.135352 0.142614 0.143158 0.162674
qa: -0.1063 -0.4437 0.1391 -0.3745 -0.4044 0.3475 0.2914 -0.0580 -0.2624 -0.1609 -0.2395 -0.1111 -0.3763 -0.3628 0.0465 0.0559 -0.2327 -0.2311 -0.1347 -0.1395 0.0804 0.0844 0.0837 0.0813 0.0878 0.0737 0.0902 0.1257 0.1510 0.1081 0.0911 0.1015 0.0951 0.1067 0.0927 0.1049 0.0946 0.2162 0.1755 0.1291 0.1354 0.1426 0.1432 0.1627
va: 1.1990 2.0240 3.3333 2.8619 3.0267 3.8536 3.6673 3.8341 3.9582 3.9113 3.9047 3.8239 3.9585 3.9226 3.5282 4.0495 3.9764 3.9839 3.9727 3.9666 4.0137 3.8302 1.0148 1.0211 1.0219 1.0145 1.0043 0.9981 1.0043 1.0022 1.0174 1.0064 1.0023 0.9985 0.9997 1.0043 1.0192 1.0666 0.9929 1.0274 1.0077 1.0050 1.0044 0.9943
dispcorr: -0.026912101 hartree
energy: -1360.881006771795
dipole: -38.26199 36.99434 -1.26766 1.78719 -1.10958 0.67761 2.76194 -1.37218 1.38976
magnitude: 1.99939 au
magnitude: 5.08204 debye
