program: Orca
programVersion: 4.2.1
elementType: Cl O N N N C C C C C C C C C C C C C C C C C H H H H H H H H H H H H H H H H H H H H H H
charge: 0
multiplicity: 1
keywords: wb97x-d3
keywords: def2-TZVPP
keywords: def2/J RIJCOSX GRIDX6 NOFINALGRIDX
keywords: grid4 nofinalgrid
keywords: scfconv7
keywords: smallprint printgap noloewdin
keywords: NOSOSCF
formula: C17H22ClN3O
InChI: InChI=1S/C17H22ClN3O/c1-16(2)8-7-14(9-13-3-5-15(18)6-4-13)17(16,22)10-21-12-19-11-20-21/h3-6,11-12,14,22H,7-10H2,1-2H3
44 atoms
Cl 5.162959 0.913809 0.595944
O  -1.33638 0.334642 -1.501695
N  -0.478018 -2.145838 -0.151334
N  -0.3369 -2.289824 -1.471673
N  -0.513691 -4.293254 -0.496386
C  -1.597545 0.082051 -0.144991
C  -3.064001 -0.430414 0.045083
C  -1.599991 1.45439 0.583795
C  -3.851324 0.863185 -0.197121
C  -3.058525 1.961357 0.509036
C  -0.514066 -0.830048 0.451861
C  -0.618538 2.497593 0.036833
C  -3.314559 -0.921579 1.474537
C  -3.511251 -1.515722 -0.930594
C  0.83281 2.1304 0.159531
C  -0.580355 -3.352113 0.414618
C  1.574254 1.71654 -0.94272
C  1.468784 2.169106 1.397622
C  2.904035 1.344688 -0.818137
C  2.79541 1.796827 1.542931
C  -0.368299 -3.593156 -1.63438
C  3.50695 1.382199 0.428385
H  -1.340127 1.279132 1.633739
H  -4.881338 0.78453 0.157871
H  -3.897773 1.061817 -1.269572
H  -3.121345 2.908292 -0.029512
H  -3.44877 2.152811 1.50998
H  -0.673033 -0.970876 1.519928
H  0.467367 -0.372922 0.326894
H  -0.794575 3.423895 0.592653
H  -0.86345 2.715467 -1.002945
H  -4.380738 -1.101028 1.622322
H  -2.810412 -1.867742 1.679998
H  -3.002481 -0.207319 2.238709
H  -3.056847 -2.487238 -0.734979
H  -4.591359 -1.653827 -0.844522
H  -3.307271 -1.243237 -1.965274
H  -1.053411 -0.489927 -1.925267
H  -0.696132 -3.49674 1.477841
H  1.100097 1.669325 -1.913911
H  0.919338 2.500518 2.271471
H  3.465807 1.023447 -1.684446
H  3.274529 1.834147 2.511553
H  -0.279913 -4.048508 -2.607964
totalener: -1360.82937881 hartree
nucrepener: 2034.79933325 hartree
electener: -3395.62871206 hartree
oneelecener: -5901.85803345 hartree
twoeener: 2506.22932140 hartree
kineticenergy: 1356.14965717 hartree
xcener: -110.264679451630 hartree
chargesum: 0.0000000
charge: -0.084306 -0.397992 0.140362 -0.342919 -0.324908 0.342632 0.276933 -0.063568 -0.244876 -0.160591 -0.257920 -0.137037 -0.364957 -0.342319 0.059827 0.032107 -0.206735 -0.220217 -0.109021 -0.119623 0.078603 0.074894 0.069725 0.075200 0.095090 0.072596 0.084560 0.105969 0.155387 0.104468 0.095929 0.097940 0.083396 0.099546 0.092722 0.097497 0.095410 0.199296 0.141012 0.117535 0.110352 0.122894 0.121214 0.133891
qa: -0.0843 -0.3980 0.1404 -0.3429 -0.3249 0.3426 0.2769 -0.0636 -0.2449 -0.1606 -0.2579 -0.1370 -0.3650 -0.3423 0.0598 0.0321 -0.2067 -0.2202 -0.1090 -0.1196 0.0786 0.0749 0.0697 0.0752 0.0951 0.0726 0.0846 0.1060 0.1554 0.1045 0.0959 0.0979 0.0834 0.0995 0.0927 0.0975 0.0954 0.1993 0.1410 0.1175 0.1104 0.1229 0.1212 0.1339
va: 1.2219 2.0735 3.3181 2.8698 3.0585 3.8506 3.6996 3.8406 3.9662 3.9164 3.9161 3.8551 3.9551 3.9325 3.5861 4.0751 3.9997 4.0037 3.9860 3.9965 4.0251 3.9285 1.0144 1.0216 1.0223 1.0175 1.0061 1.0003 1.0057 1.0006 1.0183 1.0116 1.0059 0.9992 1.0010 1.0056 1.0210 1.0869 1.0019 1.0294 1.0133 1.0115 1.0118 1.0016
dispcorr: -0.026999535 hartree
energy: -1360.856378343081
dipole: -37.99677 37.08818 -0.90859 1.92941 -1.40919 0.52022 2.53759 -1.74720 0.79038
magnitude: 1.31182 au
magnitude: 3.33438 debye
