program: Orca
programVersion: 4.2.1
elementType: Cl F F F O O N N N C C C C C C C C C C C C C C C C C C H H H H H H H H H H H H H H H
charge: 0
multiplicity: 1
keywords: wb97x-d3
keywords: def2-TZVPP
keywords: def2/J RIJCOSX GRIDX6 NOFINALGRIDX
keywords: grid4 nofinalgrid
keywords: scfconv7
keywords: smallprint printgap noloewdin
keywords: NOSOSCF
formula: C18H15ClF3N3O2
InChI: InChI=1S/C18H15ClF3N3O2/c1-17(26,9-25-11-23-10-24-25)15-7-6-14(8-16(15)18(20,21)22)27-13-4-2-12(19)3-5-13/h2-8,10-11,26H,9H2,1H3
42 atoms
Cl -6.003188 -2.260324 1.805514
F  0.949096 -2.394849 1.168218
F  2.735233 -2.522282 0.01185
F  2.565836 -1.094639 1.631611
O  4.303219 -0.323865 -0.303885
O  -1.976033 -0.134582 -1.880226
N  2.540968 2.690023 0.668706
N  2.58927 3.814171 -0.051155
N  0.598127 3.621963 0.967249
C  3.51793 0.797616 -0.637472
C  2.061342 0.42257 -0.939412
C  3.579868 1.693865 0.62483
C  4.184947 1.51918 -1.811042
C  1.337934 -0.636993 -0.357175
C  1.35782 1.249787 -1.814928
C  -0.005906 -0.828309 -0.671337
C  0.018204 1.083692 -2.10728
C  -0.667115 0.035057 -1.528092
C  1.914262 -1.650733 0.605403
C  1.346513 2.585169 1.252114
C  1.40771 4.333543 0.162128
C  -2.874618 -0.638286 -0.974045
C  -3.792051 -1.567392 -1.43953
C  -2.918648 -0.198161 0.342729
C  -4.764784 -2.062906 -0.585265
C  -3.882155 -0.703336 1.200878
C  -4.798117 -1.632502 0.731456
H  3.480996 1.089405 1.522511
H  4.546382 2.194263 0.676269
H  4.09581 0.941589 -2.732457
H  3.789832 2.514807 -1.995125
H  5.244865 1.637756 -1.585867
H  1.858844 2.077636 -2.292126
H  -0.550424 -1.660426 -0.249739
H  4.507057 -0.801942 -1.115562
H  -0.48156 1.764129 -2.783862
H  1.076468 1.75711 1.888973
H  1.120775 5.276478 -0.276322
H  -3.754641 -1.901063 -2.468256
H  -2.215869 0.538042 0.711618
H  -5.482235 -2.784951 -0.95002
H  -3.916007 -0.36319 2.226708
elementType: Cl F O N C H
totalener: -1769.53521551 hartree
nucrepener: 2708.40917420 hartree
electener: -4477.94438971 hartree
oneelecener: -7813.67612475 hartree
twoeener: 3335.73173503 hartree
cpcmener: -0.03287048 hartree
kineticenergy: 1763.80870742 hartree
xcener: -141.173443306772 hartree
chargesum: -0.0000000
charge: -0.100715 -0.185503 -0.176667 -0.175583 -0.412437 -0.332651 0.132529 -0.366160 -0.408424 0.417689 -0.052407 -0.152959 -0.314573 -0.212622 -0.159170 -0.066084 -0.236259 0.258014 0.548286 0.071594 0.066274 0.285381 -0.252688 -0.191408 -0.109643 -0.135882 0.070117 0.140456 0.130731 0.124449 0.086150 0.113372 0.150582 0.139130 0.224505 0.150743 0.164046 0.161766 0.152068 0.158175 0.147950 0.147829
qa: -0.1007 -0.1855 -0.1767 -0.1756 -0.4124 -0.3327 0.1325 -0.3662 -0.4084 0.4177 -0.0524 -0.1530 -0.3146 -0.2126 -0.1592 -0.0661 -0.2363 0.2580 0.5483 0.0716 0.0663 0.2854 -0.2527 -0.1914 -0.1096 -0.1359 0.0701 0.1405 0.1307 0.1244 0.0861 0.1134 0.1506 0.1391 0.2245 0.1507 0.1640 0.1618 0.1521 0.1582 0.1479 0.1478
va: 1.2026 1.1086 1.1158 1.1142 2.0135 2.0745 3.3196 2.8601 3.0038 3.7007 3.5933 3.8227 3.9291 3.8532 3.8782 3.8290 4.1222 3.7525 4.4467 4.0469 4.0387 3.6826 4.0430 3.9484 3.9454 3.9782 3.8333 1.0123 1.0111 0.9989 1.0234 1.0095 0.9919 1.0194 1.0086 1.0052 1.0015 0.9958 1.0050 0.9971 1.0010 1.0031
dispcorr: -0.024518089 hartree
energy: -1769.559733602841
dipole: 14.80286 -13.83496 0.96790 20.21868 -20.28029 -0.06160 -13.88629 12.47840 -1.40790
magnitude: 1.70962 au
magnitude: 4.34551 debye
