program: Orca
programVersion: 4.2.1
elementType: Cl F F F O O N N N C C C C C C C C C C C C C C C C C C H H H H H H H H H H H H H H H
charge: 0
multiplicity: 1
keywords: wb97x-d3
keywords: def2-TZVPP
keywords: def2/J RIJCOSX GRIDX6 NOFINALGRIDX
keywords: grid4 nofinalgrid
keywords: scfconv7
keywords: smallprint printgap noloewdin
keywords: NOSOSCF
formula: C18H15ClF3N3O2
InChI: InChI=1S/C18H15ClF3N3O2/c1-17(26,9-25-11-23-10-24-25)15-7-6-14(8-16(15)18(20,21)22)27-13-4-2-12(19)3-5-13/h2-8,10-11,26H,9H2,1H3
42 atoms
Cl -6.092752 -2.198446 1.818119
F  1.09239 -2.686331 0.853313
F  3.065192 -2.116213 0.30186
F  2.02968 -1.086934 1.903441
O  3.891783 0.401856 0.606123
O  -2.002667 -0.297574 -1.919008
N  2.693387 3.051046 -0.005169
N  2.529559 2.780332 1.294116
N  1.013178 4.280652 0.616888
C  3.462446 0.786719 -0.677893
C  2.008396 0.381327 -0.955058
C  3.649021 2.316187 -0.802134
C  4.38882 0.130207 -1.69544
C  1.297621 -0.652993 -0.320951
C  1.329748 1.084567 -1.950628
C  -0.044792 -0.874967 -0.627449
C  0.002155 0.870638 -2.261659
C  -0.696833 -0.100185 -1.570106
C  1.888287 -1.617477 0.683113
C  1.777818 3.934583 -0.393035
C  1.516417 3.542863 1.620168
C  -2.911898 -0.747782 -0.996288
C  -2.979915 -0.22831 0.289499
C  -3.820285 -1.70513 -1.419594
C  -3.959042 -0.681724 1.158793
C  -4.808698 -2.148575 -0.55515
C  -4.866335 -1.638271 0.730971
H  4.658775 2.559302 -0.468333
H  3.565411 2.670218 -1.826916
H  4.362012 -0.954597 -1.60868
H  4.095474 0.39066 -2.711954
H  5.41881 0.459147 -1.546692
H  1.845383 1.843588 -2.520976
H  -0.590214 -1.668305 -0.137182
H  3.463392 0.987491 1.250666
H  -0.480511 1.456277 -3.032639
H  1.711523 4.306594 -1.403124
H  1.126032 3.563222 2.625099
H  -2.284789 0.529751 0.625694
H  -3.763846 -2.101671 -2.42416
H  -4.012324 -0.278855 2.160329
H  -5.519456 -2.891861 -0.887727
elementType: Cl F O N C H
totalener: -1769.53843276 hartree
nucrepener: 2689.46350723 hartree
electener: -4459.00193999 hartree
oneelecener: -7776.24034992 hartree
twoeener: 3317.23840993 hartree
cpcmener: -0.03708268 hartree
kineticenergy: 1763.81315372 hartree
xcener: -141.177548113666 hartree
chargesum: -0.0000000
charge: -0.100930 -0.186457 -0.172597 -0.179077 -0.449357 -0.332122 0.132323 -0.381002 -0.415777 0.448987 -0.034208 -0.166949 -0.287035 -0.204038 -0.226308 -0.055125 -0.210222 0.247781 0.540119 0.072501 0.090013 0.296256 -0.203317 -0.258769 -0.126284 -0.105987 0.063754 0.137516 0.124500 0.103833 0.098101 0.106242 0.157195 0.141973 0.225935 0.152236 0.182788 0.165865 0.159354 0.152217 0.148443 0.147632
qa: -0.1009 -0.1865 -0.1726 -0.1791 -0.4494 -0.3321 0.1323 -0.3810 -0.4158 0.4490 -0.0342 -0.1669 -0.2870 -0.2040 -0.2263 -0.0551 -0.2102 0.2478 0.5401 0.0725 0.0900 0.2963 -0.2033 -0.2588 -0.1263 -0.1060 0.0638 0.1375 0.1245 0.1038 0.0981 0.1062 0.1572 0.1420 0.2259 0.1522 0.1828 0.1659 0.1594 0.1522 0.1484 0.1476
va: 1.2025 1.1060 1.1216 1.1099 1.9658 2.0776 3.3289 2.8655 3.0175 3.6261 3.6149 3.9362 3.9253 3.8862 3.9269 3.7874 4.0644 3.7655 4.4661 4.0352 4.0077 3.6790 3.9591 4.0480 3.9619 3.9427 3.8391 1.0077 0.9970 1.0146 1.0042 1.0072 0.9862 1.0191 1.0583 1.0050 0.9898 0.9921 0.9948 1.0051 1.0026 1.0012
dispcorr: -0.023267145 hartree
energy: -1769.561699901669
dipole: 15.27296 -14.58766 0.68530 18.75704 -17.41245 1.34459 -16.43432 13.93793 -2.49639
magnitude: 2.91711 au
magnitude: 7.41470 debye
