program: Orca
programVersion: 4.2.1
elementType: Cl F F F O O N N N C C C C C C C C C C C C C C C C C C H H H H H H H H H H H H H H H
charge: 0
multiplicity: 1
keywords: wb97x-d3
keywords: def2-TZVPP
keywords: def2/J RIJCOSX GRIDX6 NOFINALGRIDX
keywords: grid4 nofinalgrid
keywords: scfconv7
keywords: smallprint printgap noloewdin
keywords: NOSOSCF
formula: C18H15ClF3N3O2
InChI: InChI=1S/C18H15ClF3N3O2/c1-17(26,9-25-11-23-10-24-25)15-7-6-14(8-16(15)18(20,21)22)27-13-4-2-12(19)3-5-13/h2-8,10-11,26H,9H2,1H3
42 atoms
Cl -6.089975 -2.101114 1.674921
F  2.041598 -1.2714 1.806391
F  1.185961 -2.801727 0.595073
F  3.150351 -2.120964 0.148527
O  3.876425 0.385107 0.689543
O  -1.927684 -0.28548 -2.026363
N  2.574432 3.02147 0.285104
N  2.392982 2.632048 1.551995
N  0.795878 4.079498 0.94838
C  3.46827 0.868233 -0.567377
C  2.040659 0.433081 -0.925872
C  3.588128 2.409827 -0.542637
C  4.452034 0.346781 -1.608766
C  1.348407 -0.668615 -0.392179
C  1.366614 1.189544 -1.884619
C  0.02042 -0.901605 -0.746413
C  0.052307 0.963966 -2.243177
C  -0.63296 -0.073161 -1.641491
C  1.948152 -1.696227 0.540915
C  1.609542 3.869684 -0.060228
C  1.320629 3.295524 1.904623
C  -2.85645 -0.713086 -1.112815
C  -3.797264 -1.631595 -1.552795
C  -2.909655 -0.212637 0.18148
C  -4.801133 -2.055274 -0.696641
C  -3.905806 -0.645933 1.041902
C  -4.844056 -1.564205 0.597901
H  4.574192 2.662962 -0.151153
H  3.520195 2.857731 -1.530998
H  4.469715 -0.74166 -1.621561
H  4.178647 0.68742 -2.60683
H  5.461806 0.701979 -1.395699
H  1.873646 2.003656 -2.382916
H  -0.514407 -1.744721 -0.333329
H  3.408485 0.893479 1.371027
H  -0.430373 1.593527 -2.978699
H  1.547123 4.318096 -1.03908
H  0.902151 3.207341 2.894508
H  -3.752375 -2.013552 -2.563748
H  -2.190423 0.515897 0.532003
H  -5.535755 -2.769172 -1.041923
H  -3.947451 -0.257282 2.049699
elementType: Cl F O N C H
totalener: -1769.53833114 hartree
nucrepener: 2695.95367857 hartree
electener: -4465.49200971 hartree
oneelecener: -7789.18365602 hartree
twoeener: 3323.69164631 hartree
cpcmener: -0.03711997 hartree
kineticenergy: 1763.80972253 hartree
xcener: -141.176692694263 hartree
chargesum: 0.0000000
charge: -0.101499 -0.179266 -0.187113 -0.172695 -0.450262 -0.334176 0.129036 -0.379027 -0.415238 0.447001 -0.020389 -0.165774 -0.287956 -0.202189 -0.237291 -0.043436 -0.196472 0.221813 0.540793 0.073183 0.089813 0.293120 -0.260822 -0.194944 -0.105962 -0.131916 0.064354 0.137877 0.125018 0.104595 0.097956 0.106695 0.157663 0.142563 0.226096 0.153102 0.183409 0.165876 0.152260 0.158364 0.147802 0.148039
qa: -0.1015 -0.1793 -0.1871 -0.1727 -0.4503 -0.3342 0.1290 -0.3790 -0.4152 0.4470 -0.0204 -0.1658 -0.2880 -0.2022 -0.2373 -0.0434 -0.1965 0.2218 0.5408 0.0732 0.0898 0.2931 -0.2608 -0.1949 -0.1060 -0.1319 0.0644 0.1379 0.1250 0.1046 0.0980 0.1067 0.1577 0.1426 0.2261 0.1531 0.1834 0.1659 0.1523 0.1584 0.1478 0.1480
va: 1.2019 1.1099 1.1057 1.1215 1.9654 2.0720 3.3313 2.8639 3.0141 3.6313 3.5945 3.9317 3.9259 3.8728 3.9321 3.7865 4.0576 3.7772 4.4665 4.0357 4.0046 3.6822 4.0441 3.9459 3.9452 3.9711 3.8360 1.0076 0.9975 1.0143 1.0042 1.0069 0.9860 1.0175 1.0582 1.0040 0.9898 0.9920 1.0052 0.9961 1.0010 1.0029
dispcorr: -0.023429103 hartree
energy: -1769.561760245760
dipole: 15.04109 -14.28793 0.75317 19.88434 -18.29626 1.58808 -14.69509 12.32487 -2.37023
magnitude: 2.95080 au
magnitude: 7.50034 debye
