program: Orca
programVersion: 4.2.1
elementType: Cl F F F O O N N N C C C C C C C C C C C C C C C C C C H H H H H H H H H H H H H H H
charge: 0
multiplicity: 1
keywords: wb97x-d3
keywords: def2-TZVPP
keywords: def2/J RIJCOSX GRIDX6 NOFINALGRIDX
keywords: grid4 nofinalgrid
keywords: scfconv7
keywords: smallprint printgap noloewdin
keywords: NOSOSCF
formula: C18H15ClF3N3O2
InChI: InChI=1S/C18H15ClF3N3O2/c1-17(26,9-25-11-23-10-24-25)15-7-6-14(8-16(15)18(20,21)22)27-13-4-2-12(19)3-5-13/h2-8,10-11,26H,9H2,1H3
42 atoms
Cl -6.813729 0.381939 0.368532
F  2.772473 -2.964716 1.02534
F  4.14386 -1.782466 -0.093291
F  3.365031 -1.071526 1.802466
O  4.08571 0.878249 0.07409
O  -1.586293 -2.114328 -0.52003
N  1.808345 2.760942 0.23439
N  2.25081 2.508346 1.47215
N  0.079987 3.05156 1.520978
C  3.142027 1.04794 -0.954243
C  1.946666 0.092419 -0.836084
C  2.651527 2.514317 -0.912071
C  3.861309 0.822442 -2.278775
C  1.879282 -1.079157 -0.065063
C  0.809758 0.423758 -1.576389
C  0.676126 -1.778173 0.037143
C  -0.373288 -0.282136 -1.507924
C  -0.444898 -1.369163 -0.655948
C  3.04812 -1.70036 0.66429
C  0.512788 3.062447 0.28086
C  1.18141 2.697417 2.204306
C  -2.779403 -1.471756 -0.316326
C  -3.916693 -2.089582 -0.816461
C  -2.879715 -0.284089 0.397875
C  -5.162252 -1.522996 -0.600638
C  -4.125391 0.287699 0.604847
C  -5.258305 -0.334205 0.105392
H  3.524688 3.165482 -0.86215
H  2.095647 2.801698 -1.800154
H  3.178536 0.929953 -3.12063
H  4.670558 1.543472 -2.405676
H  4.286916 -0.179524 -2.319897
H  0.833366 1.27149 -2.247068
H  0.593525 -2.660784 0.654791
H  3.721843 1.266088 0.886095
H  -1.220737 0.02669 -2.105719
H  -0.066023 3.305173 -0.595909
H  1.203953 2.581407 3.276328
H  -3.832559 -3.014982 -1.370998
H  -2.004095 0.204885 0.804957
H  -6.046474 -2.008094 -0.990297
H  -4.202804 1.211776 1.161007
elementType: Cl F O N C H
totalener: -1769.53768292 hartree
nucrepener: 2696.14430106 hartree
electener: -4465.68198399 hartree
oneelecener: -7789.30441791 hartree
twoeener: 3323.62243392 hartree
cpcmener: -0.03636578 hartree
kineticenergy: 1763.80455416 hartree
xcener: -141.175474825013 hartree
chargesum: 0.0000000
charge: -0.102695 -0.186801 -0.172941 -0.180319 -0.451276 -0.337070 0.132798 -0.380714 -0.412013 0.439098 0.034353 -0.157166 -0.286893 -0.220823 -0.268108 -0.051397 -0.137741 0.167340 0.542287 0.079230 0.085642 0.283221 -0.253285 -0.169959 -0.111942 -0.143556 0.069289 0.137640 0.125960 0.097059 0.107366 0.105262 0.156695 0.134226 0.226756 0.161735 0.180682 0.164780 0.152310 0.148580 0.147934 0.144454
qa: -0.1027 -0.1868 -0.1729 -0.1803 -0.4513 -0.3371 0.1328 -0.3807 -0.4120 0.4391 0.0344 -0.1572 -0.2869 -0.2208 -0.2681 -0.0514 -0.1377 0.1673 0.5423 0.0792 0.0856 0.2832 -0.2533 -0.1700 -0.1119 -0.1436 0.0693 0.1376 0.1260 0.0971 0.1074 0.1053 0.1567 0.1342 0.2268 0.1617 0.1807 0.1648 0.1523 0.1486 0.1479 0.1445
va: 1.2007 1.1075 1.1211 1.1090 1.9676 2.0636 3.3206 2.8701 3.0023 3.6589 3.5339 3.9102 3.9307 3.8806 3.9231 3.9281 3.9448 3.8228 4.4624 4.0195 4.0147 3.7011 4.0305 3.9220 3.9568 3.9890 3.8330 1.0089 1.0001 1.0042 1.0067 1.0134 0.9907 1.0244 1.0595 0.9927 0.9900 0.9929 1.0050 1.0041 1.0009 1.0059
dispcorr: -0.023974323 hartree
energy: -1769.561657247431
dipole: 6.10748 -6.55926 -0.45178 14.73703 -13.47225 1.26478 -13.80229 11.43005 -2.37224
magnitude: 2.72604 au
magnitude: 6.92905 debye
