program: Orca
programVersion: 4.2.1
elementType: Cl F F F O O N N N C C C C C C C C C C C C C C C C C C H H H H H H H H H H H H H H H
charge: 0
multiplicity: 1
keywords: wb97x-d3
keywords: def2-TZVPP
keywords: def2/J RIJCOSX GRIDX6 NOFINALGRIDX
keywords: grid4 nofinalgrid
keywords: scfconv7
keywords: smallprint printgap noloewdin
keywords: NOSOSCF
formula: C18H15ClF3N3O2
InChI: InChI=1S/C18H15ClF3N3O2/c1-17(26,9-25-11-23-10-24-25)15-7-6-14(8-16(15)18(20,21)22)27-13-4-2-12(19)3-5-13/h2-8,10-11,26H,9H2,1H3
42 atoms
Cl -6.436231 -3.495264 1.145239
F  0.343754 -1.861405 1.579984
F  2.201955 -1.97058 0.541253
F  1.80033 -0.352421 1.926773
O  3.541326 0.332803 0.037953
O  -2.567495 -0.368566 -1.94636
N  3.829841 3.127443 0.709257
N  4.150685 4.254275 0.065443
N  5.874107 3.55009 1.317276
C  2.706349 1.301743 -0.545432
C  1.287244 0.776327 -0.807635
C  2.579688 2.447038 0.473832
C  3.370101 1.78641 -1.837974
C  0.657923 -0.300038 -0.158657
C  0.531881 1.456179 -1.764823
C  -0.627452 -0.695654 -0.532469
C  -0.753282 1.095223 -2.112164
C  -1.330017 -0.005132 -1.503773
C  1.270195 -1.109087 0.962962
C  4.867595 2.717789 1.43841
C  5.377659 4.465263 0.464378
C  -3.422552 -1.106034 -1.16766
C  -4.08474 -2.157558 -1.782328
C  -3.686602 -0.780498 0.156075
C  -5.022056 -2.891575 -1.072866
C  -4.61252 -1.523872 0.870771
C  -5.274017 -2.573282 0.251795
H  1.866245 3.188544 0.121266
H  2.209388 2.067305 1.424723
H  3.330759 1.005825 -2.599601
H  2.921527 2.683838 -2.256829
H  4.419862 2.010283 -1.6480
H  0.953461 2.312664 -2.269996
H  -1.085885 -1.553259 -0.063094
H  3.881923 -0.237931 -0.659893
H  -1.295061 1.656214 -2.862193
H  4.844648 1.832688 2.052769
H  5.937755 5.324301 0.129698
H  -3.87925 -2.398544 -2.816958
H  -3.187508 0.049618 0.638985
H  -5.542656 -3.707233 -1.555174
H  -4.817954 -1.273699 1.90236
elementType: Cl F O N C H
totalener: -1769.53678874 hartree
nucrepener: 2598.69435383 hartree
electener: -4368.23114257 hartree
oneelecener: -7593.82169297 hartree
twoeener: 3225.59055041 hartree
cpcmener: -0.03467660 hartree
kineticenergy: 1763.80232989 hartree
xcener: -141.170823245256 hartree
chargesum: 0.0000000
charge: -0.100407 -0.187118 -0.178769 -0.174808 -0.414385 -0.328835 0.097435 -0.353119 -0.421787 0.497919 -0.059100 -0.147504 -0.346685 -0.204511 -0.199794 -0.079014 -0.229686 0.268027 0.540065 0.080562 0.060927 0.313324 -0.263648 -0.229307 -0.102210 -0.116204 0.059962 0.127345 0.144076 0.127318 0.096682 0.110129 0.157195 0.141417 0.221380 0.150450 0.166369 0.163128 0.152562 0.164217 0.147853 0.148550
qa: -0.1004 -0.1871 -0.1788 -0.1748 -0.4144 -0.3288 0.0974 -0.3531 -0.4218 0.4979 -0.0591 -0.1475 -0.3467 -0.2045 -0.1998 -0.0790 -0.2297 0.2680 0.5401 0.0806 0.0609 0.3133 -0.2636 -0.2293 -0.1022 -0.1162 0.0600 0.1273 0.1441 0.1273 0.0967 0.1101 0.1572 0.1414 0.2214 0.1504 0.1664 0.1631 0.1526 0.1642 0.1479 0.1485
va: 1.2031 1.1051 1.1113 1.1187 2.0023 2.0846 3.3566 2.8777 3.0291 3.5687 3.6007 3.8393 3.9638 3.9124 3.9979 3.8160 4.0761 3.7784 4.4701 4.0629 4.0482 3.6544 4.0560 3.9759 3.9384 3.9482 3.8423 1.0168 1.0099 1.0000 1.0095 1.0024 0.9908 1.0187 1.0117 1.0067 1.0071 0.9950 1.0052 0.9920 1.0011 1.0022
dispcorr: -0.021995995 hartree
energy: -1769.558784734351
dipole: 14.59161 -15.75795 -1.16634 20.86096 -20.95031 -0.08935 -15.16043 13.44447 -1.71597
magnitude: 2.07675 au
magnitude: 5.27867 debye
