program: Gaussian 09
title: 000030564
version: EM64L-G09RevD.01
frameworkgroup: C1[X(C16H24BrClO)]
method: RPBEPBE
basis: SDD
operation: Freq
keyword: #p
keyword: freq=noraman
keyword: PBEPBE/SDD
title: #p freq=noraman PBEPBE/SDD
converged: YES YES NO NO
title: Mulliken charges:
elementType: Br Cl O C C C C C C C C C C C C C C C C H H H H H H H H H H H H H H H H H H H H H H H H
charge: -0.025080 -0.059218 -0.281148 -0.039333 -0.389633 -0.396185 -0.324792 -0.362206 -0.359045 -0.733046 -0.073688 -0.698397 0.449458 -0.739253 -0.409041 -0.369417 -0.075741 -0.208195 -0.238340 0.183045 0.176425 0.230777 0.208965 0.214944 0.198158 0.214824 0.178027 0.196526 0.201142 0.194555 0.231859 0.215493 0.210505 0.224403 0.208256 0.209209 0.215922 0.292922 0.294270 0.264158 0.269491 0.238163 0.260260
chargesum: 0.00000
title: Mulliken charges with hydrogens summed into heavy atoms:
elementType: Br Cl O C C C C C C C C C C C C C C C C
charge: -0.025080 -0.059218 -0.281148 0.143712 0.017569 0.027725 0.088190 0.012347 0.036652 -0.075188 0.150714 -0.065009 0.449458 -0.152061 -0.144883 -0.099925 -0.075741 0.029968 0.021920
polarizability: 2.65102604e+02 2.85184048e+01 1.87515499e+02 9.67831718e+00 -2.22645906e+01 1.56931580e+02
1716.lowfreq: -9.5723 -6.9722 -6.1318 -0.0003 0.0017 0.0023 8.6257 14.7780 25.4786
frequency: 7.7680 14.5358 25.2046 38.4490 49.5726 56.0554 68.3878 71.1171 85.9399 118.4563 119.5943 140.6111 157.8539 183.8254 185.2410 213.7952 221.6356 229.0184 233.0302 258.7210 292.9116 307.9983 324.7249 376.6668 412.4660 414.3408 442.9765 468.0408 496.2203 532.3043 582.1488 611.3306 644.3690 692.0005 712.3933 724.4268 761.0383 773.0607 790.2704 801.4164 831.5079 849.3535 890.2039 893.8455 908.2990 922.0616 924.1714 942.7252 980.9671 985.7554 992.5284 1016.1158 1017.3879 1035.2114 1049.8033 1068.7210 1071.9438 1078.7221 1081.9185 1089.9830 1118.6061 1132.1297 1161.8938 1173.2375 1174.6951 1192.8278 1209.7624 1219.7683 1226.3471 1242.2059 1264.6183 1272.6978 1274.4871 1290.9105 1302.4406 1304.7122 1315.2161 1318.5528 1346.1697 1347.3370 1359.8280 1375.1863 1383.5377 1387.9441 1389.1329 1418.0415 1425.9584 1459.2028 1461.3565 1465.4959 1469.2092 1472.5856 1476.3417 1477.1811 1482.0200 1487.7232 1495.1252 1577.2071 1603.3606 2930.2088 2946.3964 2952.2674 2952.7854 2960.0414 2968.8434 2971.4755 2972.2859 2988.0537 2992.8869 2997.4657 3019.4122 3038.0351 3041.1485 3060.5572 3065.3665 3067.7534 3070.6056 3073.3924 3139.2870 3143.9062 3149.7385 3158.1771 3175.8817
redmass: 4.4292 7.0856 4.9569 2.3471 5.4444 4.3329 4.5126 1.9870 2.7560 2.2761 2.3280 4.9814 2.4165 5.7629 5.3038 3.3979 1.3551 1.3091 4.2649 2.4988 4.5666 2.3856 2.6835 6.7695 2.7307 3.9704 3.3462 3.2346 2.6790 5.9229 3.6965 3.5828 5.9419 4.1753 2.8423 1.1179 1.6091 1.2561 2.0002 1.4389 1.7876 3.1205 1.4724 1.8439 1.7615 1.4023 1.3615 1.9521 2.5737 3.6468 1.3494 2.3453 1.5427 2.2805 2.7584 2.9427 2.2993 2.3933 1.9373 1.5976 1.9295 1.9857 1.5759 2.0681 1.0880 2.4415 1.4046 1.2056 1.1636 1.2787 1.2609 1.3792 1.2336 1.0961 1.2505 1.2120 1.2979 1.2576 1.5610 1.5547 1.5942 2.0217 1.9657 1.3799 1.2668 2.4461 1.1019 1.0929 2.2247 1.0778 1.0676 1.0689 1.0460 1.0635 1.0648 1.0855 1.0566 6.4611 6.7282 1.0634 1.0758 1.0651 1.0787 1.0634 1.0588 1.0373 1.0369 1.0629 1.1021 1.0932 1.1002 1.1000 1.1015 1.0563 1.0992 1.1006 1.0992 1.1000 1.0870 1.0925 1.1104 1.0937 1.0979
irintensity: 0.1391 0.0681 0.6086 0.1287 0.4320 0.4228 0.2082 0.0467 0.0287 0.7705 0.1128 1.3709 0.7030 0.5154 1.4760 2.4574 1.6769 0.2719 1.7870 3.3649 1.1461 0.9025 1.2118 3.5451 0.3855 3.4348 6.2006 5.6770 1.0050 22.5294 19.1009 14.9186 15.2852 24.8393 52.2699 7.7681 3.2593 12.6529 8.3932 32.7297 7.9301 22.8006 8.8244 5.2600 12.3385 4.2140 0.9289 9.6818 8.7296 9.5796 1.4749 80.2446 12.3458 0.6307 8.5595 67.4539 11.9113 0.8810 15.1965 15.2599 12.7053 3.5553 5.8566 2.7509 0.7187 46.8855 2.5075 1.0753 14.5252 6.4973 0.3746 4.5883 1.7398 1.2514 5.0189 0.8701 7.4501 17.5531 2.1135 4.1752 0.4017 2.9333 5.3917 6.2719 16.0974 26.5191 12.0468 4.4801 33.5667 1.0547 2.0827 3.2776 11.5566 4.0742 11.7121 14.4460 11.0534 44.6224 14.8470 10.8379 41.8784 19.2732 32.7762 22.7166 84.2965 42.3397 18.0558 16.7015 65.3568 7.5107 3.2896 8.3755 59.0822 11.1676 39.9492 101.8728 51.8735 86.1652 4.6092 1.3662 3.0114 6.3064 6.4641
temp: 298.150 k
press: 1.00000 atm
elementType: 35 17 8 6 6 6 6 6 6 6 6 6 6 6 6 6 6 6 6 1 1 1 1 1 1 1 1 1 1 1 1 1 1 1 1 1 1 1 1 1 1 1 1
symmnumber: 1
zpe: 949010.5 jmol-1
zpe.correction: 0.361459 hartree
zpe.thermalcorrener: 0.383772 hartree
zpe.thermalcorrenthalpy: 0.384716 hartree
zpe.thermalcorrgfe: 0.304188 hartree
zpe.sumelectzpe: -1171.352626 hartree
zpe.sumelectthermal: -1171.330313 hartree
zpe.sumelectthermalent: -1171.329369 hartree
zpe.sumelectthermalfe: -1171.409897 hartree
dipole: -0.3823 -2.3341 0.5145
dipole: 2.4206
quadrupole: -140.9690 -136.9249 -128.7895
quadrupole: -1.0987 -7.4849 -4.0711
quadrupole: -5.4079 -1.3638 6.7716 -1.0987 -7.4849 -4.0711
hfenergy: -1171.7140851 hartree
pointgroup: C01 [X(C16H24Br1Cl1O1)]
dipole: 0.1528468 0.8425699 0.4166847 debye
polarizability: 263.9132654|32.2176873|175.9543937|-6.046472|25.7206959|169.6820243 unknown
InChI: InChI=1S/C16H24BrClO/c1-3-5-7-13(4-2)12-19-16(11-17)14-8-6-9-15(18)10-14/h6,8-10,13,16H,3-5,7,11-12H2,1-2H3
charge 0 multiplicity 1
43 atoms
Br -0.523389 -3.833836 -0.663777
Cl 5.941155 0.200138 -1.605439
O  -0.284772 -0.592477 -0.006981
C  -1.982605 1.150498 -0.235003
C  -3.122258 0.112739 -0.436549
C  -1.848128 1.606834 1.244332
C  -0.657329 0.601091 -0.794788
C  -4.541909 0.63545 -0.120864
C  -5.645917 -0.37925 -0.499477
C  -0.819772 2.736022 1.477408
C  0.923141 -1.254157 -0.488405
C  -7.066754 0.120262 -0.160243
C  2.200416 -0.517848 -0.056593
C  0.929712 -2.660875 0.123372
C  3.323281 -0.484548 -0.919374
C  2.278754 0.092833 1.220041
C  4.500027 0.153134 -0.484547
C  3.470981 0.726761 1.631992
C  4.600754 0.76223 0.780851
H  -2.220906 2.049191 -0.848363
H  -3.101697 -0.227549 -1.493882
H  -2.902753 -0.783466 0.175769
H  -2.838014 1.955299 1.594974
H  -1.584727 0.724913 1.860023
H  -0.785728 0.302706 -1.858741
H  0.155415 1.354961 -0.737379
H  -4.719485 1.587086 -0.666697
H  -4.634456 0.872349 0.958053
H  -5.452676 -1.336983 0.025566
H  -5.578687 -0.602534 -1.583956
H  0.212899 2.406461 1.26208
H  -0.844678 3.079046 2.52841
H  -1.035271 3.61146 0.834999
H  0.905908 -1.334763 -1.597519
H  -7.294835 1.062083 -0.694782
H  -7.168726 0.317993 0.923749
H  -7.835957 -0.622409 -0.441627
H  1.870091 -3.192263 -0.08338
H  0.725017 -2.623672 1.204161
H  3.279218 -0.94216 -1.913912
H  1.397156 0.079798 1.869754
H  3.529487 1.199626 2.618138
H  5.528214 1.252128 1.090807
