program: Orca
programVersion: 4.2.1
elementType: Cl F F F O O N N N C C C C C C C C C C C C C C C C C C H H H H H H H H H H H H H H H
charge: 0
multiplicity: 1
keywords: wb97x-d3
keywords: def2-TZVPP
keywords: def2/J RIJCOSX GRIDX6 NOFINALGRIDX
keywords: grid4 nofinalgrid
keywords: scfconv7
keywords: smallprint printgap noloewdin
keywords: NOSOSCF
formula: C18H15ClF3N3O2
InChI: InChI=1S/C18H15ClF3N3O2/c1-17(26,9-25-11-23-10-24-25)15-7-6-14(8-16(15)18(20,21)22)27-13-4-2-12(19)3-5-13/h2-8,10-11,26H,9H2,1H3
42 atoms
Cl -6.031488 -1.367803 1.953496
F  1.322811 -2.777066 0.865739
F  3.265802 -2.09821 0.324449
F  2.133238 -1.084725 1.873894
O  3.918788 0.46879 0.569447
O  -1.832462 -0.751438 -2.084735
N  2.314765 2.905966 0.096588
N  2.221171 2.541517 1.378765
N  0.458924 3.781779 0.798573
C  3.456853 0.857521 -0.695846
C  2.079501 0.272267 -1.042415
C  3.390071 2.404254 -0.727069
C  4.493182 0.401048 -1.716548
C  1.423455 -0.782652 -0.384116
C  1.406075 0.856486 -2.115672
C  0.114311 -1.112971 -0.728681
C  0.112673 0.526278 -2.470918
C  -0.549104 -0.439179 -1.73879
C  2.052439 -1.66532 0.67092
C  1.253082 3.638263 -0.237581
C  1.093542 3.088897 1.759892
C  -2.774868 -0.87893 -1.103129
C  -3.771352 -1.823601 -1.301574
C  -2.783966 -0.074149 0.029608
C  -4.781465 -1.969495 -0.364511
C  -3.787834 -0.228473 0.972379
C  -4.778923 -1.176147 0.771827
H  4.338648 2.795827 -0.356078
H  3.251286 2.801793 -1.728956
H  4.631871 -0.678631 -1.666435
H  4.189759 0.650642 -2.732762
H  5.457342 0.875847 -1.525119
H  1.895215 1.622246 -2.702613
H  -0.40321 -1.910337 -0.214186
H  3.433316 0.974071 1.24196
H  -0.375467 1.026438 -3.297253
H  1.105887 4.043078 -1.226498
H  0.721255 2.98517 2.767026
H  -3.760963 -2.445063 -2.18781
H  -2.023384 0.679279 0.190829
H  -5.556751 -2.706844 -0.522568
H  -3.79253 0.398092 1.853866
elementType: Cl F O N C H
totalener: -1769.54743056 hartree
nucrepener: 2712.92158562 hartree
electener: -4482.46901619 hartree
oneelecener: -7823.08014508 hartree
twoeener: 3340.61112890 hartree
cpcmener: -0.03142652 hartree
kineticenergy: 1763.79892130 hartree
xcener: -141.174387051645 hartree
chargesum: 0.0000000
charge: -0.100199 -0.186645 -0.170917 -0.178408 -0.435785 -0.326980 0.135645 -0.371594 -0.408780 0.444858 0.021146 -0.174395 -0.286368 -0.214936 -0.267044 -0.017003 -0.164855 0.172067 0.540254 0.073267 0.085920 0.267040 -0.246665 -0.173009 -0.108402 -0.141886 0.068693 0.137067 0.124426 0.107008 0.093792 0.104724 0.146605 0.141738 0.222022 0.151144 0.178580 0.164403 0.149643 0.153913 0.145137 0.144782
qa: -0.1002 -0.1866 -0.1709 -0.1784 -0.4358 -0.3270 0.1356 -0.3716 -0.4088 0.4449 0.0211 -0.1744 -0.2864 -0.2149 -0.2670 -0.0170 -0.1649 0.1721 0.5403 0.0733 0.0859 0.2670 -0.2467 -0.1730 -0.1084 -0.1419 0.0687 0.1371 0.1244 0.1070 0.0938 0.1047 0.1466 0.1417 0.2220 0.1511 0.1786 0.1644 0.1496 0.1539 0.1451 0.1448
va: 1.2032 1.1072 1.1241 1.1119 1.9877 2.0750 3.3206 2.8681 3.0070 3.6578 3.5382 3.9247 3.9307 3.8508 3.9537 3.7749 4.0350 3.8137 4.4698 4.0302 4.0043 3.7125 4.0306 3.9203 3.9555 3.9898 3.8388 1.0071 0.9992 1.0132 1.0048 1.0077 0.9943 1.0156 1.0661 1.0024 0.9907 0.9923 1.0059 0.9999 1.0018 1.0042
dispcorr: -0.023817711 hartree
energy: -1769.571248275465
dipole: 14.17286 -13.46704 0.70582 17.90516 -16.46749 1.43767 -16.77097 14.34150 -2.42948
magnitude: 2.90989 au
magnitude: 7.39635 debye
