program: Orca
programVersion: 4.2.1
elementType: Cl F F F O O N N N C C C C C C C C C C C C C C C C C C H H H H H H H H H H H H H H H
charge: 0
multiplicity: 1
keywords: wb97x-d3
keywords: def2-TZVPP
keywords: def2/J RIJCOSX GRIDX6 NOFINALGRIDX
keywords: grid4 nofinalgrid
keywords: scfconv7
keywords: smallprint printgap noloewdin
keywords: NOSOSCF
formula: C18H15ClF3N3O2
InChI: InChI=1S/C18H15ClF3N3O2/c1-17(26,9-25-11-23-10-24-25)15-7-6-14(8-16(15)18(20,21)22)27-13-4-2-12(19)3-5-13/h2-8,10-11,26H,9H2,1H3
42 atoms
Cl -7.545015 -1.282031 -1.311401
F  3.422361 -1.532489 -0.920442
F  3.36295 -1.679981 1.241606
F  2.402349 -3.141842 0.023941
O  3.61992 0.843185 0.291303
O  -2.091749 -2.043259 0.678391
N  3.254067 3.537453 0.513314
N  4.07175 3.437036 1.563654
N  4.82022 4.991347 0.139881
C  2.423085 1.321733 -0.25587
C  1.248971 0.358352 -0.032873
C  2.09187 2.693859 0.395811
C  2.651559 1.503819 -1.754003
C  1.351774 -1.034713 0.148171
C  -0.039192 0.892617 -0.040736
C  0.205589 -1.794947 0.361545
C  -1.182463 0.142591 0.168985
C  -1.051297 -1.215955 0.387009
C  2.643262 -1.823795 0.122762
C  3.713114 4.467157 -0.327655
C  4.994391 4.325019 1.297376
C  -3.343145 -1.80013 0.185048
C  -4.409951 -1.966797 1.055137
C  -3.563254 -1.472562 -1.146483
C  -5.707919 -1.813803 0.594212
C  -4.8604 -1.306391 -1.604882
C  -5.924153 -1.479607 -0.732821
H  1.351102 3.242545 -0.181511
H  1.690276 2.558028 1.400798
H  1.76321 1.915328 -2.232954
H  3.485417 2.181731 -1.946416
H  2.879846 0.557269 -2.240624
H  -0.185497 1.949929 -0.207817
H  0.264803 -2.862586 0.517481
H  3.598709 0.923563 1.251149
H  -2.146922 0.633109 0.171493
H  3.210457 4.732587 -1.244792
H  5.82202 4.503652 1.9662
H  -4.230289 -2.225679 2.090658
H  -2.738362 -1.353615 -1.837672
H  -6.538529 -1.95013 1.273469
H  -5.032301 -1.05391 -2.642287
elementType: Cl F O N C H
totalener: -1769.54466253 hartree
nucrepener: 2564.43285155 hartree
electener: -4333.97751408 hartree
oneelecener: -7525.23964614 hartree
twoeener: 3191.26213206 hartree
cpcmener: -0.03430859 hartree
kineticenergy: 1763.78552825 hartree
xcener: -141.167514952466 hartree
chargesum: 0.0000000
charge: -0.099065 -0.172326 -0.178702 -0.185823 -0.402383 -0.323551 0.119851 -0.353221 -0.414013 0.456015 -0.003814 -0.183509 -0.317342 -0.227509 -0.210516 -0.069564 -0.165997 0.205252 0.543884 0.055523 0.065438 0.297550 -0.253838 -0.207688 -0.103989 -0.122549 0.061673 0.127719 0.155246 0.100824 0.106940 0.110114 0.142538 0.132555 0.210281 0.156758 0.183713 0.162339 0.150175 0.158992 0.145604 0.146417
qa: -0.0991 -0.1723 -0.1787 -0.1858 -0.4024 -0.3236 0.1199 -0.3532 -0.4140 0.4560 -0.0038 -0.1835 -0.3173 -0.2275 -0.2105 -0.0696 -0.1660 0.2053 0.5439 0.0555 0.0654 0.2975 -0.2538 -0.2077 -0.1040 -0.1225 0.0617 0.1277 0.1552 0.1008 0.1069 0.1101 0.1425 0.1326 0.2103 0.1568 0.1837 0.1623 0.1502 0.1590 0.1456 0.1464
va: 1.2043 1.1235 1.1118 1.1080 2.0123 2.0868 3.3439 2.8726 3.0308 3.6073 3.6431 3.8912 3.9198 3.9299 3.9971 3.9203 3.9601 3.8375 4.4536 4.0584 4.0462 3.6906 4.0460 3.9685 3.9452 3.9584 3.8524 0.9997 1.0015 1.0027 1.0077 1.0162 1.0035 1.0272 1.0316 0.9961 0.9860 0.9940 1.0057 0.9944 1.0019 1.0032
dispcorr: -0.021541614 hartree
energy: -1769.566204144675
dipole: 4.70886 -7.01120 -2.30233 20.65719 -19.99861 0.65858 -1.86981 1.57243 -0.29738
magnitude: 2.41307 au
magnitude: 6.13353 debye
