program: Orca
programVersion: 4.2.1
elementType: Cl F F F O O N N N C C C C C C C C C C C C C C C C C C H H H H H H H H H H H H H H H
charge: 0
multiplicity: 1
keywords: wb97x-d3
keywords: def2-TZVPP
keywords: def2/J RIJCOSX GRIDX6 NOFINALGRIDX
keywords: grid4 nofinalgrid
keywords: scfconv7
keywords: smallprint printgap noloewdin
keywords: NOSOSCF
formula: C18H15ClF3N3O2
InChI: InChI=1S/C18H15ClF3N3O2/c1-17(26,9-25-11-23-10-24-25)15-7-6-14(8-16(15)18(20,21)22)27-13-4-2-12(19)3-5-13/h2-8,10-11,26H,9H2,1H3
42 atoms
Cl -7.5692 -1.282102 -1.251236
F  3.448123 -1.458371 -0.929383
F  3.349471 -1.7417 1.217165
F  2.406378 -3.118373 -0.10836
O  3.55054 0.822462 0.450868
O  -2.080225 -2.06922 0.627036
N  3.265401 3.527057 0.651047
N  3.631537 4.3705 -0.318241
N  5.121642 4.404584 1.351909
C  2.410681 1.35061 -0.174462
C  1.247816 0.3767 0.023808
C  2.095116 2.694396 0.542168
C  2.626662 1.585195 -1.669031
C  1.357226 -1.022838 0.137462
C  -0.0404 0.908584 0.054652
C  0.212694 -1.794956 0.315021
C  -1.180732 0.146705 0.235016
C  -1.045685 -1.221664 0.375732
C  2.649422 -1.80997 0.082364
C  4.164463 3.554962 1.637017
C  4.747366 4.872704 0.145422
C  -3.33887 -1.817133 0.160162
C  -4.393273 -2.122632 1.008177
C  -3.58144 -1.349895 -1.125073
C  -5.699008 -1.965672 0.572757
C  -4.887684 -1.178734 -1.55581
C  -5.937932 -1.488423 -0.705965
H  1.33676 3.276875 0.024254
H  1.736031 2.498844 1.552729
H  2.828878 0.652371 -2.19272
H  1.743008 2.033576 -2.122819
H  3.46305 2.263612 -1.848882
H  -0.187229 1.972835 -0.056919
H  0.274885 -2.868875 0.417134
H  4.329422 1.005031 -0.083994
H  -2.145394 0.635184 0.273194
H  4.073916 2.9587 2.531203
H  5.311307 5.60969 -0.40553
H  -4.1965 -2.492071 2.006362
H  -2.768785 -1.125208 -1.80404
H  -6.518494 -2.209313 1.235106
H  -5.076424 -0.81493 -2.556585
elementType: Cl F O N C H
totalener: -1769.54475184 hartree
nucrepener: 2564.40758809 hartree
electener: -4333.95233993 hartree
oneelecener: -7525.26315857 hartree
twoeener: 3191.31081863 hartree
cpcmener: -0.03110387 hartree
kineticenergy: 1763.79398878 hartree
xcener: -141.169821593479 hartree
chargesum: 0.0000000
charge: -0.099319 -0.179168 -0.171721 -0.186655 -0.398267 -0.322511 0.117044 -0.367107 -0.415844 0.324787 0.051334 -0.132646 -0.302375 -0.224329 -0.183997 -0.076665 -0.187013 0.220152 0.542201 0.064898 0.070852 0.314756 -0.263414 -0.220703 -0.099844 -0.119924 0.057248 0.121720 0.140925 0.114962 0.100190 0.112932 0.145202 0.131622 0.229105 0.158015 0.169926 0.162014 0.150360 0.159030 0.145669 0.146559
qa: -0.0993 -0.1792 -0.1717 -0.1867 -0.3983 -0.3225 0.1170 -0.3671 -0.4158 0.3248 0.0513 -0.1326 -0.3024 -0.2243 -0.1840 -0.0767 -0.1870 0.2202 0.5422 0.0649 0.0709 0.3148 -0.2634 -0.2207 -0.0998 -0.1199 0.0572 0.1217 0.1409 0.1150 0.1002 0.1129 0.1452 0.1316 0.2291 0.1580 0.1699 0.1620 0.1504 0.1590 0.1457 0.1466
va: 1.2043 1.1183 1.1182 1.1055 2.0177 2.0905 3.3637 2.8643 3.0265 3.8083 3.5263 3.8303 3.9034 3.9444 3.9746 3.9278 3.9795 3.8260 4.4618 4.0713 4.0300 3.6773 4.0480 3.9694 3.9428 3.9569 3.8547 1.0155 1.0004 1.0119 1.0065 1.0158 1.0015 1.0281 1.0070 0.9953 1.0018 0.9941 1.0062 0.9946 1.0019 1.0031
dispcorr: -0.021593680 hartree
energy: -1769.566345519609
dipole: 5.67928 -7.14078 -1.46150 20.26809 -19.99617 0.27193 -1.24411 0.89553 -0.34859
magnitude: 1.52690 au
magnitude: 3.88108 debye
