program: Orca
programVersion: 4.2.1
elementType: Cl F F F O O N N N C C C C C C C C C C C C C C C C C C H H H H H H H H H H H H H H H
charge: 0
multiplicity: 1
keywords: wb97x-d3
keywords: def2-TZVPP
keywords: def2/J RIJCOSX GRIDX6 NOFINALGRIDX
keywords: grid4 nofinalgrid
keywords: scfconv7
keywords: smallprint printgap noloewdin
keywords: NOSOSCF
formula: C18H15ClF3N3O2
InChI: InChI=1S/C18H15ClF3N3O2/c1-17(26,9-25-11-23-10-24-25)15-7-6-14(8-16(15)18(20,21)22)27-13-4-2-12(19)3-5-13/h2-8,10-11,26H,9H2,1H3
42 atoms
Cl -6.010446 -4.363574 -0.884293
F  1.831868 -1.295099 1.833369
F  0.514583 -2.438205 0.610226
F  2.261272 -1.607549 -0.270589
O  3.239606 0.666744 0.677454
O  -3.109871 0.6348 0.061329
N  4.122667 3.248478 0.458653
N  4.878874 3.713316 -0.540493
N  6.116249 3.409993 1.299602
C  2.520574 1.479745 -0.210868
C  1.033246 1.129669 -0.130201
C  2.727559 2.941285 0.278479
C  2.997447 1.314244 -1.652754
C  0.490094 -0.108071 0.260028
C  0.127287 2.117813 -0.517832
C  -0.893001 -0.275442 0.325521
C  -1.242439 1.945312 -0.487105
C  -1.755799 0.743416 -0.03855
C  1.293975 -1.341892 0.612812
C  4.874725 3.067955 1.546941
C  6.063154 3.794851 0.009515
C  -3.730675 -0.562505 -0.16769
C  -4.745744 -0.930604 0.702338
C  -3.414482 -1.358788 -1.260892
C  -5.455973 -2.099791 0.479231
C  -4.115709 -2.533979 -1.477172
C  -5.131985 -2.897011 -0.606836
H  2.325555 3.678943 -0.41168
H  2.230171 3.077804 1.238737
H  2.446567 1.97115 -2.325277
H  4.056457 1.556958 -1.756263
H  2.849835 0.291382 -1.996626
H  0.488586 3.071626 -0.874658
H  -1.309945 -1.212501 0.664612
H  4.053166 0.368434 0.259424
H  -1.902156 2.744085 -0.800351
H  4.477966 2.705195 2.481963
H  6.921847 4.149859 -0.539662
H  -4.987335 -0.302417 1.550116
H  -2.631631 -1.074201 -1.952588
H  -6.249484 -2.383933 1.157044
H  -3.870163 -3.154902 -2.32791
elementType: Cl F O N C H
totalener: -1769.54489100 hartree
nucrepener: 2592.95832296 hartree
electener: -4362.50321396 hartree
oneelecener: -7582.56647298 hartree
twoeener: 3220.06325901 hartree
cpcmener: -0.03085678 hartree
kineticenergy: 1763.79066008 hartree
xcener: -141.168940452766 hartree
chargesum: 0.0000000
charge: -0.098556 -0.171432 -0.187188 -0.179036 -0.400465 -0.324810 0.117260 -0.369264 -0.416096 0.339250 0.044021 -0.132475 -0.306286 -0.228884 -0.181420 -0.025145 -0.224290 0.214271 0.540392 0.063973 0.071971 0.274465 -0.250192 -0.190442 -0.105748 -0.125608 0.063520 0.123446 0.137518 0.101225 0.113036 0.116246 0.145686 0.137641 0.230332 0.149597 0.171083 0.162192 0.149835 0.158546 0.145953 0.145876
qa: -0.0986 -0.1714 -0.1872 -0.1790 -0.4005 -0.3248 0.1173 -0.3693 -0.4161 0.3392 0.0440 -0.1325 -0.3063 -0.2289 -0.1814 -0.0251 -0.2243 0.2143 0.5404 0.0640 0.0720 0.2745 -0.2502 -0.1904 -0.1057 -0.1256 0.0635 0.1234 0.1375 0.1012 0.1130 0.1162 0.1457 0.1376 0.2303 0.1496 0.1711 0.1622 0.1498 0.1585 0.1460 0.1459
va: 1.2049 1.1194 1.1034 1.1179 2.0166 2.0823 3.3582 2.8657 3.0264 3.8028 3.5079 3.8369 3.9099 3.9125 3.9762 3.7746 4.0815 3.8109 4.4688 4.0692 4.0290 3.7094 4.0449 3.9538 3.9475 3.9641 3.8496 1.0176 1.0019 1.0059 1.0145 1.0103 0.9986 1.0194 1.0065 1.0064 1.0018 0.9942 1.0056 0.9940 1.0017 1.0034
dispcorr: -0.021891474 hartree
energy: -1769.566782479112
dipole: 12.31124 -13.47950 -1.16826 25.34304 -24.35436 0.98867 -6.22147 5.44732 -0.77415
magnitude: 1.71512 au
magnitude: 4.35948 debye
