program: Orca
programVersion: 4.2.1
elementType: Cl F F F O O N N N C C C C C C C C C C C C C C C C C C H H H H H H H H H H H H H H H
charge: 0
multiplicity: 1
keywords: wb97x-d3
keywords: def2-TZVPP
keywords: def2/J RIJCOSX GRIDX6 NOFINALGRIDX
keywords: grid4 nofinalgrid
keywords: scfconv7
keywords: smallprint printgap noloewdin
keywords: NOSOSCF
formula: C18H15ClF3N3O2
InChI: InChI=1S/C18H15ClF3N3O2/c1-17(26,9-25-11-23-10-24-25)15-7-6-14(8-16(15)18(20,21)22)27-13-4-2-12(19)3-5-13/h2-8,10-11,26H,9H2,1H3
42 atoms
Cl -5.925652 -4.455638 0.052741
F  1.730914 -1.747833 0.72817
F  1.967108 -0.011118 2.000336
F  0.206237 -1.197571 2.113647
O  3.259897 0.21787 -0.27999
O  -3.075857 0.572861 -0.888199
N  4.205246 2.793425 0.519247
N  4.876684 3.681088 -0.218939
N  6.25931 2.64169 1.202486
C  2.565204 1.368797 -0.687019
C  1.065254 1.067949 -0.661964
C  2.803818 2.526738 0.314016
C  3.050766 1.766889 -2.082431
C  0.416132 0.157765 0.195439
C  0.255392 1.797771 -1.530595
C  -0.96321 -0.021039 0.109791
C  -1.112627 1.624934 -1.618537
C  -1.722884 0.694541 -0.800884
C  1.099355 -0.692039 1.246465
C  5.042921 2.176831 1.35715
C  6.100648 3.557439 0.227734
C  -3.685436 -0.62903 -0.657144
C  -3.19842 -1.819167 -1.182397
C  -4.861619 -0.612293 0.077061
C  -3.888684 -2.999418 -0.958343
C  -5.559776 -1.790531 0.289708
C  -5.064278 -2.978277 -0.223633
H  2.334853 3.441859 -0.044588
H  2.36261 2.297268 1.281795
H  2.686298 2.738653 -2.410013
H  4.141008 1.83676 -2.094343
H  2.759162 1.021741 -2.823488
H  0.69853 2.529341 -2.18999
H  -1.462532 -0.717833 0.767453
H  4.125131 0.201692 -0.703779
H  -1.693431 2.208769 -2.321045
H  4.723905 1.421364 2.05809
H  6.910548 4.154845 -0.161985
H  -2.289485 -1.842772 -1.770464
H  -5.238308 0.32023 0.477764
H  -3.507805 -3.926463 -1.364973
H  -6.47851 -1.773956 0.86031
elementType: Cl F O N C H
totalener: -1769.54492406 hartree
nucrepener: 2606.18420002 hartree
electener: -4375.72912408 hartree
oneelecener: -7609.02864808 hartree
twoeener: 3233.29952399 hartree
cpcmener: -0.03000484 hartree
kineticenergy: 1763.78942663 hartree
xcener: -141.168108818662 hartree
chargesum: -0.0000000
charge: -0.099207 -0.170896 -0.175174 -0.185599 -0.383608 -0.322911 0.121011 -0.369385 -0.414712 0.359995 -0.006727 -0.160892 -0.318539 -0.195299 -0.146722 -0.080113 -0.244851 0.250297 0.541484 0.062268 0.070392 0.282920 -0.197427 -0.254139 -0.124868 -0.103008 0.062944 0.129995 0.143055 0.095417 0.102502 0.130022 0.157703 0.142146 0.221634 0.148505 0.169479 0.161705 0.158896 0.149910 0.145928 0.145867
qa: -0.0992 -0.1709 -0.1752 -0.1856 -0.3836 -0.3229 0.1210 -0.3694 -0.4147 0.3600 -0.0067 -0.1609 -0.3185 -0.1953 -0.1467 -0.0801 -0.2449 0.2503 0.5415 0.0623 0.0704 0.2829 -0.1974 -0.2541 -0.1249 -0.1030 0.0629 0.1300 0.1431 0.0954 0.1025 0.1300 0.1577 0.1421 0.2216 0.1485 0.1695 0.1617 0.1589 0.1499 0.1459 0.1459
va: 1.2041 1.1195 1.1176 1.1076 2.0424 2.0891 3.3438 2.8694 3.0347 3.8094 3.5241 3.8179 3.9316 3.9176 3.9528 3.8321 4.1101 3.7644 4.4657 4.0681 4.0343 3.7024 3.9563 4.0465 3.9641 3.9466 3.8495 1.0156 1.0082 1.0087 1.0122 1.0037 0.9877 1.0188 1.0197 1.0069 1.0034 0.9948 0.9939 1.0058 1.0033 1.0019
dispcorr: -0.022097791 hartree
energy: -1769.567021852904
dipole: 13.87002 -14.89772 -1.02770 21.76614 -20.88202 0.88412 -14.52591 13.15484 -1.37107
magnitude: 1.92813 au
magnitude: 4.90091 debye
