program: Orca
programVersion: 4.2.1
elementType: Cl F F F O O N N N C C C C C C C C C C C C C C C C C C H H H H H H H H H H H H H H H
charge: 0
multiplicity: 1
keywords: wb97x-d3
keywords: def2-TZVPP
keywords: def2/J RIJCOSX GRIDX6 NOFINALGRIDX
keywords: grid4 nofinalgrid
keywords: scfconv7
keywords: smallprint printgap noloewdin
keywords: NOSOSCF
formula: C18H15ClF3N3O2
InChI: InChI=1S/C18H15ClF3N3O2/c1-17(26,9-25-11-23-10-24-25)15-7-6-14(8-16(15)18(20,21)22)27-13-4-2-12(19)3-5-13/h2-8,10-11,26H,9H2,1H3
42 atoms
Cl -7.598828 -0.919721 -0.269462
F  2.354603 -2.761705 1.359284
F  3.557668 -1.973913 -0.213514
F  3.225718 -0.838251 1.602431
O  3.711481 0.715817 -0.504955
O  -1.927524 -2.363149 -0.475199
N  3.313426 3.192141 0.859968
N  3.009509 4.448105 0.521082
N  5.171534 4.290519 1.078278
C  2.440259 1.311078 -0.508023
C  1.312588 0.270326 -0.465678
C  2.336107 2.133775 0.788939
C  2.329895 2.225459 -1.732578
C  1.399373 -1.025734 0.079798
C  0.071311 0.65474 -0.96963
C  0.286171 -1.861654 0.066846
C  -1.038604 -0.16995 -0.985044
C  -0.92303 -1.445176 -0.463714
C  2.6425 -1.628629 0.698065
C  4.605897 3.111752 1.18439
C  4.151449 5.069618 0.668444
C  -3.234941 -1.96391 -0.426819
C  -3.68613 -1.030501 0.497451
C  -4.121652 -2.579122 -1.297133
C  -5.032173 -0.705116 0.540734
C  -5.470599 -2.264466 -1.245117
C  -5.915782 -1.323909 -0.330374
H  1.352418 2.593255 0.861376
H  2.458849 1.492707 1.659926
H  2.218485 1.639959 -2.645779
H  1.501416 2.928001 -1.683297
H  3.23901 2.817625 -1.828752
H  -0.052826 1.643429 -1.386393
H  0.334754 -2.863309 0.469278
H  3.934099 0.449308 -1.402729
H  -1.964684 0.192607 -1.411431
H  5.080042 2.194966 1.4964
H  4.251877 6.127192 0.478106
H  -3.004417 -0.556047 1.192094
H  -3.763194 -3.309085 -2.01152
H  -5.383965 0.021925 1.260073
H  -6.161446 -2.748108 -1.922358
elementType: Cl F O N C H
totalener: -1769.54727650 hartree
nucrepener: 2575.13742622 hartree
electener: -4344.68470272 hartree
oneelecener: -7546.60033772 hartree
twoeener: 3201.91563499 hartree
cpcmener: -0.03021996 hartree
kineticenergy: 1763.79468939 hartree
xcener: -141.169083888124 hartree
chargesum: 0.0000000
charge: -0.098165 -0.185748 -0.177556 -0.174593 -0.398093 -0.323307 0.105123 -0.352821 -0.415557 0.474905 -0.041912 -0.157974 -0.346062 -0.207371 -0.212006 -0.089716 -0.169153 0.217195 0.546682 0.078340 0.061867 0.288936 -0.204543 -0.248542 -0.122701 -0.106130 0.063383 0.128384 0.145953 0.129686 0.094544 0.113502 0.153131 0.132660 0.213824 0.155361 0.165007 0.161144 0.159889 0.149936 0.146320 0.146178
qa: -0.0982 -0.1857 -0.1776 -0.1746 -0.3981 -0.3233 0.1051 -0.3528 -0.4156 0.4749 -0.0419 -0.1580 -0.3461 -0.2074 -0.2120 -0.0897 -0.1692 0.2172 0.5467 0.0783 0.0619 0.2889 -0.2045 -0.2485 -0.1227 -0.1061 0.0634 0.1284 0.1460 0.1297 0.0945 0.1135 0.1531 0.1327 0.2138 0.1554 0.1650 0.1611 0.1599 0.1499 0.1463 0.1462
va: 1.2053 1.1080 1.1134 1.1197 2.0148 2.0862 3.3447 2.8732 3.0332 3.6080 3.5914 3.8265 3.9523 3.9357 4.0170 3.9469 3.9716 3.8210 4.4549 4.0640 4.0464 3.6942 3.9668 4.0446 3.9589 3.9459 3.8512 1.0175 1.0095 0.9994 1.0094 1.0044 0.9958 1.0281 1.0183 0.9971 1.0067 0.9951 0.9937 1.0054 1.0030 1.0018
dispcorr: -0.021837125 hartree
energy: -1769.569113629497
dipole: 5.52326 -6.99858 -1.47532 18.27621 -18.83717 -0.56096 -8.82799 7.62103 -1.20696
magnitude: 1.98696 au
magnitude: 5.05044 debye
