program: Orca
programVersion: 4.2.1
elementType: Cl F F F O O N N N C C C C C C C C C C C C C C C C C C H H H H H H H H H H H H H H H
charge: 0
multiplicity: 1
keywords: wb97x-d3
keywords: def2-TZVPP
keywords: def2/J RIJCOSX GRIDX6 NOFINALGRIDX
keywords: grid4 nofinalgrid
keywords: scfconv7
keywords: smallprint printgap noloewdin
keywords: NOSOSCF
formula: C18H15ClF3N3O2
InChI: InChI=1S/C18H15ClF3N3O2/c1-17(26,9-25-11-23-10-24-25)15-7-6-14(8-16(15)18(20,21)22)27-13-4-2-12(19)3-5-13/h2-8,10-11,26H,9H2,1H3
42 atoms
Cl -6.378198 -3.199212 1.505454
F  0.373504 -1.844809 1.578946
F  2.261086 -1.940426 0.596137
F  1.769337 -0.270762 1.889332
O  3.535723 0.353801 0.000082
O  -2.510569 -0.602766 -2.042118
N  3.76551 3.11685 0.602271
N  4.199314 4.168606 -0.097148
N  5.71188 3.576736 1.442974
C  2.700173 1.2656 -0.662166
C  1.301777 0.690399 -0.930375
C  2.519802 2.461273 0.290391
C  3.385955 1.701935 -1.961268
C  0.682372 -0.358037 -0.225918
C  0.55609 1.288563 -1.947135
C  -0.588781 -0.796786 -0.595991
C  -0.715944 0.881523 -2.295586
C  -1.285803 -0.183146 -1.622397
C  1.291222 -1.091341 0.950308
C  4.679219 2.771246 1.511559
C  5.367198 4.409108 0.441111
C  -3.374098 -1.206869 -1.168458
C  -3.689569 -0.63503 0.057229
C  -3.980431 -2.384782 -1.57477
C  -4.612484 -1.253951 0.88411
C  -4.914745 -2.997741 -0.75399
C  -5.219131 -2.431203 0.472896
H  1.85869 3.202625 -0.15483
H  2.061685 2.137014 1.223539
H  3.350666 0.901717 -2.702967
H  2.952282 2.592636 -2.410809
H  4.43438 1.925859 -1.765178
H  0.974368 2.11692 -2.500212
H  -1.045378 -1.629146 -0.080924
H  3.926322 -0.242022 -0.648638
H  -1.252625 1.380901 -3.0918
H  4.547006 1.949161 2.196678
H  5.992599 5.221195 0.103598
H  -3.229257 0.291778 0.375363
H  -3.731468 -2.822416 -2.532747
H  -4.85925 -0.809532 1.838591
H  -5.390013 -3.915277 -1.072851
elementType: Cl F O N C H
totalener: -1769.54658090 hartree
nucrepener: 2604.80657527 hartree
electener: -4374.35315617 hartree
oneelecener: -7606.13207586 hartree
twoeener: 3231.77891969 hartree
cpcmener: -0.03008667 hartree
kineticenergy: 1763.79715046 hartree
xcener: -141.169180314234 hartree
chargesum: -0.0000000
charge: -0.098171 -0.185874 -0.177425 -0.174256 -0.399141 -0.323219 0.108059 -0.355053 -0.416833 0.471068 -0.045772 -0.158292 -0.336537 -0.209595 -0.203111 -0.047137 -0.214470 0.221686 0.543791 0.079538 0.063447 0.265853 -0.190979 -0.242171 -0.125984 -0.109169 0.068888 0.128941 0.142659 0.127294 0.093196 0.111684 0.153647 0.139122 0.214975 0.149060 0.165320 0.160970 0.160165 0.150711 0.146856 0.146264
qa: -0.0982 -0.1859 -0.1774 -0.1743 -0.3991 -0.3232 0.1081 -0.3551 -0.4168 0.4711 -0.0458 -0.1583 -0.3365 -0.2096 -0.2031 -0.0471 -0.2145 0.2217 0.5438 0.0795 0.0634 0.2659 -0.1910 -0.2422 -0.1260 -0.1092 0.0689 0.1289 0.1427 0.1273 0.0932 0.1117 0.1536 0.1391 0.2150 0.1491 0.1653 0.1610 0.1602 0.1507 0.1469 0.1463
va: 1.2054 1.1066 1.1138 1.1194 2.0166 2.0865 3.3450 2.8760 3.0329 3.6201 3.5712 3.8373 3.9468 3.9169 4.0065 3.7880 4.0794 3.8106 4.4652 4.0637 4.0434 3.7159 3.9634 4.0469 3.9625 3.9483 3.8488 1.0165 1.0096 0.9994 1.0109 1.0065 0.9924 1.0203 1.0179 1.0065 1.0049 0.9952 0.9936 1.0050 1.0031 1.0020
dispcorr: -0.022052550 hartree
energy: -1769.568633449717
dipole: 14.37169 -15.51111 -1.13942 19.75766 -19.92593 -0.16827 -16.44147 14.65249 -1.78897
magnitude: 2.12768 au
magnitude: 5.40813 debye
