program: Orca
programVersion: 4.2.1
elementType: Cl F F F O O N N N C C C C C C C C C C C C C C C C C C H H H H H H H H H H H H H H H
charge: 0
multiplicity: 1
keywords: wb97x-d3
keywords: def2-TZVPP
keywords: def2/J RIJCOSX GRIDX6 NOFINALGRIDX
keywords: grid4 nofinalgrid
keywords: scfconv7
keywords: smallprint printgap noloewdin
keywords: NOSOSCF
formula: C18H15ClF3N3O2
InChI: InChI=1S/C18H15ClF3N3O2/c1-17(26,9-25-11-23-10-24-25)15-7-6-14(8-16(15)18(20,21)22)27-13-4-2-12(19)3-5-13/h2-8,10-11,26H,9H2,1H3
42 atoms
Cl -6.062175 -3.598868 -1.799127
F  0.559636 -2.12687 -0.926258
F  2.15051 -0.744801 -1.235339
F  2.122612 -1.994924 0.525724
O  2.658527 2.506211 1.881523
O  -2.935224 0.018853 1.576389
N  3.964799 2.712088 -0.768581
N  4.549896 3.580535 0.063273
N  5.938192 3.06317 -1.61108
C  2.537802 1.520673 0.881926
C  1.100637 0.972228 1.003526
C  2.63806 2.207045 -0.501683
C  3.66239 0.504319 1.105335
C  0.568159 -0.216674 0.466331
C  0.200798 1.793698 1.688027
C  -0.775504 -0.540112 0.651794
C  -1.134035 1.486703 1.855726
C  -1.629046 0.30491 1.339288
C  1.353932 -1.264368 -0.286442
C  4.811574 2.410488 -1.758703
C  5.731475 3.761113 -0.480718
C  -3.617715 -0.833985 0.756252
C  -4.281728 -1.902789 1.336438
C  -3.705615 -0.612671 -0.612009
C  -5.04245 -2.75347 0.550219
C  -4.456025 -1.468958 -1.399653
C  -5.122023 -2.536147 -0.815507
H  2.387237 1.526733 -1.309329
H  1.929297 3.036872 -0.53431
H  3.471185 -0.073323 2.00821
H  3.833784 -0.17861 0.280441
H  4.598029 1.043005 1.261315
H  0.563495 2.716175 2.110966
H  -1.164745 -1.467607 0.258876
H  3.424399 3.059287 1.665289
H  -1.786869 2.159906 2.395515
H  4.566347 1.724565 -2.554877
H  6.464344 4.421509 -0.044854
H  -4.210087 -2.063797 2.403794
H  -3.195641 0.227238 -1.066214
H  -5.565443 -3.585475 1.000833
H  -4.528731 -1.300681 -2.465114
totalener: -1769.52134638 hartree
nucrepener: 2604.68120238 hartree
electener: -4374.20254877 hartree
oneelecener: -7605.59126866 hartree
twoeener: 3231.38871989 hartree
kineticenergy: 1763.78925720 hartree
xcener: -141.169671316583 hartree
chargesum: -0.0000000
charge: -0.075304 -0.168682 -0.187985 -0.161716 -0.376268 -0.295078 0.107122 -0.350751 -0.329177 0.345493 0.023809 -0.188052 -0.334985 -0.197255 -0.122549 -0.093009 -0.198465 0.216944 0.559447 0.064324 0.082916 0.232927 -0.202923 -0.173132 -0.091907 -0.104285 0.060951 0.103665 0.135545 0.122218 0.088007 0.100665 0.139105 0.134881 0.204457 0.131532 0.143250 0.137334 0.130877 0.136403 0.124839 0.124814
qa: -0.0753 -0.1687 -0.1880 -0.1617 -0.3763 -0.2951 0.1071 -0.3508 -0.3292 0.3455 0.0238 -0.1881 -0.3350 -0.1973 -0.1225 -0.0930 -0.1985 0.2169 0.5594 0.0643 0.0829 0.2329 -0.2029 -0.1731 -0.0919 -0.1043 0.0610 0.1037 0.1355 0.1222 0.0880 0.1007 0.1391 0.1349 0.2045 0.1315 0.1433 0.1373 0.1309 0.1364 0.1248 0.1248
va: 1.2294 1.1337 1.1012 1.1355 2.0395 2.1161 3.3317 2.8587 3.0595 3.7303 3.5506 3.9273 3.9556 3.9418 4.0090 3.8289 4.0441 3.8646 4.3953 4.0566 4.0259 3.8292 4.0535 3.9861 3.9662 3.9813 3.9475 1.0169 1.0010 1.0077 1.0207 1.0123 1.0421 1.0250 1.0802 1.0130 1.0002 0.9995 1.0114 1.0015 1.0092 1.0103
dispcorr: -0.022226892 hartree
energy: -1769.543573275387
dipole: 13.85955 -14.50723 -0.64768 20.06058 -19.82586 0.23472 8.97219 -8.98040 -0.00821
magnitude: 0.68894 au
magnitude: 1.75116 debye
