program: Orca
programVersion: 4.2.1
elementType: Cl F F F O O N N N C C C C C C C C C C C C C C C C C C H H H H H H H H H H H H H H H
charge: 0
multiplicity: 1
keywords: wb97x-d3
keywords: def2-TZVPP
keywords: def2/J RIJCOSX GRIDX6 NOFINALGRIDX
keywords: grid4 nofinalgrid
keywords: scfconv7
keywords: smallprint printgap noloewdin
keywords: NOSOSCF
formula: C18H15ClF3N3O2
InChI: InChI=1S/C18H15ClF3N3O2/c1-17(26,9-25-11-23-10-24-25)15-7-6-14(8-16(15)18(20,21)22)27-13-4-2-12(19)3-5-13/h2-8,10-11,26H,9H2,1H3
42 atoms
Cl -6.027046 -0.327049 1.805318
F  1.659932 -2.751838 1.075127
F  3.540701 -1.991924 0.420458
F  2.371689 -0.923323 1.907252
O  4.029282 0.633846 0.426934
O  -1.657747 -1.267537 -1.981988
N  1.954591 2.713801 0.0828
N  2.02359 2.382952 1.377866
N  -0.071833 2.94354 0.83758
C  3.443778 0.949733 -0.796119
C  2.161195 0.159906 -1.107744
C  3.081355 2.461011 -0.782636
C  4.503456 0.6928 -1.8635
C  1.60089 -0.881294 -0.348574
C  1.44838 0.571846 -2.233907
C  0.322224 -1.342112 -0.650963
C  0.188564 0.102046 -2.550725
C  -0.395674 -0.828728 -1.715963
C  2.312776 -1.619859 0.767984
C  0.692204 3.033338 -0.223283
C  0.78879 2.538236 1.791184
C  -2.634474 -1.016028 -1.060557
C  -2.574038 0.040997 -0.160908
C  -3.739698 -1.855791 -1.079149
C  -3.622698 0.249396 0.721586
C  -4.786892 -1.640633 -0.200639
C  -4.723498 -0.589797 0.701506
H  3.945576 3.021211 -0.422041
H  2.832042 2.842462 -1.771036
H  5.378358 1.320603 -1.689473
H  4.822402 -0.347576 -1.820099
H  4.131807 0.888444 -2.868488
H  1.87972 1.317567 -2.889925
H  -0.135315 -2.120424 -0.057356
H  3.51988 1.045094 1.142044
H  -0.340867 0.467836 -3.420494
H  0.378715 3.326594 -1.212954
H  0.503302 2.354424 2.814648
H  -1.728366 0.716243 -0.130338
H  -3.778022 -2.675836 -1.783803
H  -3.574564 1.074008 1.41902
H  -5.646934 -2.295479 -0.214408
totalener: -1769.51759894 hartree
nucrepener: 2749.42580813 hartree
electener: -4518.94340707 hartree
oneelecener: -7895.59318735 hartree
twoeener: 3376.64978028 hartree
kineticenergy: 1763.81345188 hartree
xcener: -141.173798113025 hartree
chargesum: 0.0000000
charge: -0.083794 -0.177960 -0.155437 -0.169916 -0.368594 -0.305074 0.135249 -0.342034 -0.348888 0.426951 0.076193 -0.208693 -0.273300 -0.240266 -0.287588 0.003514 -0.128217 0.124614 0.542482 0.061615 0.091655 0.214139 -0.112239 -0.186193 -0.179575 -0.109682 0.092407 0.135130 0.107341 0.098945 0.112660 0.077814 0.113664 0.136412 0.205928 0.134984 0.139459 0.137290 0.132568 0.127923 0.127649 0.120864
qa: -0.0838 -0.1780 -0.1554 -0.1699 -0.3686 -0.3051 0.1352 -0.3420 -0.3489 0.4270 0.0762 -0.2087 -0.2733 -0.2403 -0.2876 0.0035 -0.1282 0.1246 0.5425 0.0616 0.0917 0.2141 -0.1122 -0.1862 -0.1796 -0.1097 0.0924 0.1351 0.1073 0.0989 0.1127 0.0778 0.1137 0.1364 0.2059 0.1350 0.1395 0.1373 0.1326 0.1279 0.1276 0.1209
va: 1.2209 1.1198 1.1488 1.1241 2.0619 2.0937 3.2811 2.8696 3.0088 3.7170 3.4815 3.9581 3.9275 3.8879 3.9794 3.8227 4.0255 3.9171 4.4633 4.0304 4.0127 3.8075 3.8783 4.0115 4.0747 4.0089 3.8983 1.0093 1.0014 1.0111 1.0153 1.0043 1.0057 1.0169 1.0799 1.0068 1.0029 1.0008 1.0136 1.0131 1.0135 1.0102
dispcorr: -0.025284253 hartree
energy: -1769.542883194849
dipole: 12.26519 -11.72658 0.53861 15.81891 -14.83663 0.98228 -17.52550 15.83874 -1.68676
magnitude: 2.02488 au
magnitude: 5.14683 debye
