program: Gaussian 09
title: 000030502
version: EM64L-G09RevD.01
frameworkgroup: C1[X(C16H14O3)]
method: RPBEPBE
basis: SDD
operation: Freq
keyword: #pfreq=noraman
keyword: PBEPBE/SDD
title: #p freq=noraman PBEPBE/SDD
converged: YES YES NO NO
title: Mulliken charges:
elementType: O O O C C C C C C C C C C C C C C C C H H H H H H H H H H H H H H
charge: -0.276696 -0.405013 -0.206202 0.284371 0.254981 0.348466 -0.373316 0.192710 -0.322869 -0.397556 -0.352089 -0.375936 -0.268405 -0.230908 -0.237486 -0.235499 -0.043333 -0.243798 -0.535332 0.258735 0.243680 0.242005 0.233370 0.240485 0.229326 0.227064 0.225285 0.225201 0.229239 0.221485 0.226205 0.247090 0.374740
chargesum: 0.00000
title: Mulliken charges with hydrogens summed into heavy atoms:
elementType: O O O C C C C C C C C C C C C C C C C
charge: -0.276696 -0.030273 -0.206202 0.284371 0.254981 0.348466 -0.114580 0.192710 -0.079189 -0.155551 -0.118719 -0.135451 -0.039079 -0.003845 -0.012201 -0.010298 -0.043333 -0.014560 0.159448
polarizability: 3.22277977e+02 -1.33546280e+01 1.85769080e+02 -7.33504573e+00 -4.59478100e+00 1.11552029e+02
1716.lowfreq: -6.7899 -5.9071 0.0006 0.0007 0.0007 6.9072 8.9857 26.3506 46.1568
frequency: 8.0605 26.2236 46.1539 59.1674 71.1858 99.7787 125.1436 144.0362 152.7786 203.4335 223.8854 258.1567 266.1917 289.4583 338.0815 346.9488 404.7525 443.3939 450.3715 486.9700 491.5388 539.6719 555.5350 559.7169 592.7785 614.2394 629.9430 657.2370 696.0859 706.5062 733.5231 753.1684 755.1544 764.0291 772.8415 834.6327 844.8715 848.8376 895.5025 920.5571 934.7922 956.4668 972.4029 974.0166 987.5284 988.2211 992.6317 1027.9640 1042.7286 1051.2426 1086.6723 1105.3826 1112.5302 1151.8236 1173.3318 1176.3489 1195.6663 1201.4804 1222.7023 1248.5286 1278.1277 1297.3384 1320.3952 1347.8070 1377.9973 1390.4108 1430.1051 1436.4416 1448.4775 1467.0815 1469.7656 1480.4060 1487.9026 1579.1959 1581.9606 1599.8918 1607.2833 1615.1955 1633.2754 2964.0334 3054.0154 3121.8839 3123.1150 3127.7536 3128.1383 3132.4261 3140.3613 3143.2030 3149.4282 3160.1192 3165.1229 3171.8132 3494.9568
redmass: 7.4050 5.1042 4.1375 5.1002 5.4276 3.5364 5.4335 4.7537 4.5718 4.1765 1.9727 4.0487 2.1982 3.3183 5.4500 4.0188 2.8173 5.0526 3.6516 3.2274 4.1030 3.6362 3.8767 4.1192 3.7308 4.1591 1.8412 5.4540 1.8272 4.0417 3.7814 3.9811 1.4152 3.5532 2.6099 3.4360 1.3610 1.4980 1.4698 1.5110 1.4574 4.9834 1.4306 1.3423 7.9675 4.5700 1.4200 2.4086 2.3709 2.0729 1.6359 2.2515 1.2616 1.3783 1.0524 1.0790 1.1470 1.6548 2.9930 2.1061 2.7734 1.6367 1.3894 2.0138 7.5748 4.4054 1.4388 2.3062 1.7535 1.2672 1.1258 1.6641 2.1958 6.2897 6.1060 6.5487 6.3723 6.9274 8.8650 1.0327 1.1040 1.0871 1.0857 1.0994 1.0875 1.0854 1.0920 1.0902 1.0964 1.0940 1.1017 1.0997 1.0638
irintensity: 0.5289 0.5517 0.7316 2.3098 0.1459 4.6158 1.3320 0.6632 0.4461 0.3267 0.4049 1.2400 2.2367 3.6051 2.9559 0.4643 0.3607 3.5357 0.9813 7.5916 2.8562 11.0192 21.0923 22.6197 48.0756 13.6928 71.0036 5.5067 47.6799 3.0845 2.1868 33.2602 70.0779 7.9071 33.4498 1.0711 0.5203 1.6133 9.1765 0.9952 3.5036 40.3331 0.7727 0.2969 31.4183 8.3295 0.4388 69.5076 191.0887 76.2352 6.6036 70.0665 0.6879 0.4809 0.0738 11.6182 0.4620 9.6053 116.8249 19.7542 10.7273 7.8779 13.6399 38.3285 0.3897 69.8694 24.3471 7.1725 14.8825 59.1150 26.3422 3.8032 25.2511 3.0593 5.3870 30.6387 34.8347 21.8842 168.5311 79.7820 42.5733 25.6871 0.3787 18.2709 1.5609 0.0222 14.3493 9.0313 37.6594 24.2500 31.6849 24.1058 26.2703
temp: 298.150 k
press: 1.00000 atm
elementType: 8 8 8 6 6 6 6 6 6 6 6 6 6 6 6 6 6 6 6 1 1 1 1 1 1 1 1 1 1 1 1 1 1
symmnumber: 1
zpe: 670736.8 jmol-1
zpe.correction: 0.255470 hartree
zpe.thermalcorrener: 0.272618 hartree
zpe.thermalcorrenthalpy: 0.273562 hartree
zpe.thermalcorrgfe: 0.207473 hartree
zpe.sumelectzpe: -842.411076 hartree
zpe.sumelectthermal: -842.393928 hartree
zpe.sumelectthermalent: -842.392984 hartree
zpe.sumelectthermalfe: -842.459073 hartree
dipole: 1.6298 1.7755 -0.9257
dipole: 2.5818
quadrupole: -86.9214 -93.4438 -116.3905
quadrupole: 7.4041 -2.0731 2.4321
quadrupole: 11.9972 5.4748 -17.4719 7.4041 -2.0731 2.4321
hfenergy: -842.6665457 hartree
pointgroup: C01 [X(C16H14O3)]
dipole: -0.5671976 0.3415112 0.7703366 debye
polarizability: 323.6416342|2.7177852|148.1008622|-4.8776865|36.8912085|147.85659 unknown
InChI: InChI=1S/C16H14O3/c1-19-15-10-6-5-9-13(15)11-14(16(17)18)12-7-3-2-4-8-12/h2-11,17H,1H3
charge 0 multiplicity 1
33 atoms
O  -2.054362 2.032405 1.024184
O  1.229152 -2.450232 -1.687636
O  -0.09381 -0.854153 -2.726529
C  -1.695003 -0.160571 0.124903
C  0.791463 -0.422161 -0.461871
C  2.206442 -0.163703 -0.077015
C  -0.258138 0.108262 0.254868
C  -2.628087 0.840503 0.556093
C  -2.224956 -1.395473 -0.337843
C  2.567655 0.04271 1.284802
C  3.232045 -0.091257 -1.061385
C  -4.023041 0.61782 0.490108
C  -3.613051 -1.625519 -0.408724
C  -4.511153 -0.614045 0.000317
C  3.899306 0.335598 1.644882
C  4.56362 0.199285 -0.701284
C  0.562451 -1.209014 -1.720531
C  4.90527 0.418109 0.653788
C  -2.951757 3.091404 1.492339
H  -0.001455 0.831783 1.038872
H  -1.533098 -2.199062 -0.610116
H  1.806068 -0.058786 2.065927
H  2.98263 -0.243975 -2.1177
H  -4.729289 1.389365 0.809603
H  -3.991638 -2.588012 -0.767141
H  -5.592431 -0.78324 -0.050793
H  4.155854 0.48341 2.69998
H  5.335262 0.25855 -1.476985
H  5.940983 0.639807 0.934026
H  -3.571666 2.748534 2.343437
H  -3.60572 3.450143 0.674597
H  -2.287295 3.904469 1.819142
H  1.092151 -2.907752 -2.562813
