program: Orca
programVersion: 4.2.1
elementType: Cl F F F O O N N N C C C C C C C C C C C C C C C C C C H H H H H H H H H H H H H H H
charge: 0
multiplicity: 1
keywords: wb97x-d3
keywords: def2-TZVPP
keywords: def2/J RIJCOSX GRIDX6 NOFINALGRIDX
keywords: grid4 nofinalgrid
keywords: scfconv7
keywords: smallprint printgap noloewdin
keywords: NOSOSCF
formula: C18H15ClF3N3O2
InChI: InChI=1S/C18H15ClF3N3O2/c1-17(26,9-25-11-23-10-24-25)15-7-6-14(8-16(15)18(20,21)22)27-13-4-2-12(19)3-5-13/h2-8,10-11,26H,9H2,1H3
42 atoms
Cl -7.046172 -0.476652 -1.324729
F  3.577482 -2.370375 -0.805939
F  4.019761 -1.20891 0.972719
F  2.770266 -2.927248 1.087457
O  4.140722 0.223012 -1.31105
O  -1.686854 -1.6142 0.735437
N  2.602958 2.642312 0.911121
N  2.144881 3.801331 0.427257
N  1.041414 3.247982 2.298625
C  3.061697 1.051902 -0.962702
C  1.826846 0.258707 -0.51992
C  3.608384 1.875668 0.227312
C  2.759287 1.978055 -2.146504
C  1.827541 -1.023783 0.065234
C  0.588474 0.88634 -0.644295
C  0.62589 -1.614824 0.441089
C  -0.605917 0.314142 -0.248396
C  -0.584815 -0.959258 0.28915
C  3.060907 -1.867702 0.31893
C  1.926863 2.324873 2.024213
C  1.212075 4.126393 1.290453
C  -2.915657 -1.311478 0.221505
C  -3.164357 -1.35819 -1.14398
C  -3.936192 -1.011723 1.109019
C  -4.43793 -1.096618 -1.619597
C  -5.213824 -0.761044 0.634241
C  -5.458129 -0.79871 -0.728697
H  4.064707 1.204645 0.951966
H  4.382205 2.557059 -0.127169
H  2.287582 1.427996 -2.963982
H  2.124043 2.822935 -1.894039
H  3.700793 2.392157 -2.508821
H  0.537827 1.883367 -1.055895
H  0.604895 -2.60354 0.874857
H  3.966062 -0.169174 -2.171111
H  -1.527493 0.869973 -0.356469
H  2.114743 1.425196 2.590259
H  0.642954 5.037886 1.19444
H  -2.371674 -1.603656 -1.839086
H  -3.732218 -0.981547 2.170993
H  -4.637035 -1.133335 -2.681529
H  -6.012706 -0.530596 1.325016
totalener: -1769.51771816 hartree
nucrepener: 2656.02514404 hartree
electener: -4425.54286220 hartree
oneelecener: -7708.59894141 hartree
twoeener: 3283.05607920 hartree
kineticenergy: 1763.80990012 hartree
xcener: -141.170118321844 hartree
chargesum: -0.0000000
charge: -0.075420 -0.172463 -0.166928 -0.175100 -0.328907 -0.297089 0.128066 -0.339707 -0.321656 0.378698 -0.061661 -0.157886 -0.307918 -0.222855 -0.202115 -0.071890 -0.113206 0.181206 0.555673 0.039874 0.066907 0.238966 -0.174930 -0.199171 -0.107456 -0.092701 0.061182 0.137531 0.118812 0.105486 0.095589 0.111900 0.129181 0.132122 0.177571 0.136140 0.141687 0.133315 0.136595 0.132254 0.125148 0.125154
qa: -0.0754 -0.1725 -0.1669 -0.1751 -0.3289 -0.2971 0.1281 -0.3397 -0.3217 0.3787 -0.0617 -0.1579 -0.3079 -0.2229 -0.2021 -0.0719 -0.1132 0.1812 0.5557 0.0399 0.0669 0.2390 -0.1749 -0.1992 -0.1075 -0.0927 0.0612 0.1375 0.1188 0.1055 0.0956 0.1119 0.1292 0.1321 0.1776 0.1361 0.1417 0.1333 0.1366 0.1323 0.1251 0.1252
va: 1.2292 1.1243 1.1293 1.1226 2.0872 2.1135 3.2804 2.8246 3.0576 3.7679 3.5535 3.8547 3.9308 3.9481 3.9837 3.9342 3.9979 3.8886 4.4379 4.0792 4.0312 3.8218 3.9852 4.0534 3.9792 3.9667 3.9485 1.0123 1.0180 1.0009 1.0320 1.0099 1.0060 1.0284 1.0500 1.0045 1.0048 1.0010 1.0018 1.0111 1.0104 1.0093
dispcorr: -0.023623951 hartree
energy: -1769.541342111936
dipole: 5.58887 -5.71193 -0.12306 18.57561 -18.62562 -0.05001 -5.34429 4.47639 -0.86790
magnitude: 0.87801 au
magnitude: 2.23172 debye
