program: Orca
programVersion: 4.2.1
elementType: Cl F F F O O N N N C C C C C C C C C C C C C C C C C C H H H H H H H H H H H H H H H
charge: 0
multiplicity: 1
keywords: wb97x-d3
keywords: def2-TZVPP
keywords: def2/J RIJCOSX GRIDX6 NOFINALGRIDX
keywords: grid4 nofinalgrid
keywords: scfconv7
keywords: smallprint printgap noloewdin
keywords: NOSOSCF
formula: C18H15ClF3N3O2
InChI: InChI=1S/C18H15ClF3N3O2/c1-17(26,9-25-11-23-10-24-25)15-7-6-14(8-16(15)18(20,21)22)27-13-4-2-12(19)3-5-13/h2-8,10-11,26H,9H2,1H3
42 atoms
Cl -7.121954 -0.000787 0.001391
F  2.764777 -2.627858 -1.257652
F  3.027115 -0.604597 -1.90578
F  4.08139 -1.344794 -0.182817
O  2.395251 2.091161 2.193184
O  -1.687976 -2.174867 0.162433
N  2.848562 2.352061 -0.691804
N  1.867918 3.159036 -0.271224
N  1.990679 3.204133 -2.499817
C  2.894868 1.026693 1.420632
C  1.731586 0.099155 0.982514
C  3.691397 1.653805 0.256279
C  3.840669 0.288933 2.367875
C  1.732907 -0.947553 0.03882
C  0.531716 0.302626 1.667185
C  0.563886 -1.659901 -0.225067
C  -0.620733 -0.420237 1.4308
C  -0.609208 -1.39978 0.455461
C  2.901635 -1.377159 -0.813913
C  2.908704 2.397517 -2.027585
C  1.375665 3.640733 -1.387372
C  -2.932562 -1.615828 0.138618
C  -3.978051 -2.360315 0.663049
C  -3.176774 -0.374094 -0.43468
C  -5.27154 -1.866907 0.614634
C  -4.46869 0.122885 -0.472885
C  -5.511738 -0.623816 0.052171
H  4.386074 2.369849 0.702069
H  4.292087 0.940156 -0.296034
H  3.29078 0.007197 3.265271
H  4.265342 -0.611589 1.940484
H  4.655423 0.947073 2.673852
H  0.502344 1.059833 2.434597
H  0.548212 -2.445532 -0.966478
H  1.944575 2.710638 1.593777
H  -1.513438 -0.212114 2.006209
H  3.628441 1.843035 -2.607523
H  0.549309 4.33377 -1.393884
H  -3.779188 -3.32833 1.103271
H  -2.368198 0.20828 -0.857263
H  -6.087942 -2.44713 1.021353
H  -4.661856 1.08831 -0.919372
totalener: -1769.52124657 hartree
nucrepener: 2662.46234642 hartree
electener: -4431.98359299 hartree
oneelecener: -7721.23326267 hartree
twoeener: 3289.24966968 hartree
kineticenergy: 1763.79781360 hartree
xcener: -141.172015937707 hartree
chargesum: 0.0000000
charge: -0.078907 -0.164937 -0.175236 -0.180569 -0.372391 -0.301211 0.134804 -0.342437 -0.334264 0.437631 -0.077646 -0.266066 -0.276879 -0.182584 -0.118118 -0.069209 -0.154406 0.151781 0.553925 0.062819 0.081683 0.244994 -0.218917 -0.163794 -0.087870 -0.114717 0.058727 0.136980 0.121079 0.104855 0.096808 0.093176 0.133987 0.124510 0.202000 0.138213 0.144959 0.137495 0.130663 0.139527 0.123910 0.125635
qa: -0.0789 -0.1649 -0.1752 -0.1806 -0.3724 -0.3012 0.1348 -0.3424 -0.3343 0.4376 -0.0776 -0.2661 -0.2769 -0.1826 -0.1181 -0.0692 -0.1544 0.1518 0.5539 0.0628 0.0817 0.2450 -0.2189 -0.1638 -0.0879 -0.1147 0.0587 0.1370 0.1211 0.1049 0.0968 0.0932 0.1340 0.1245 0.2020 0.1382 0.1450 0.1375 0.1307 0.1395 0.1239 0.1256
va: 1.2254 1.1425 1.1056 1.1141 2.0666 2.1061 3.2861 2.8945 3.0636 3.6801 3.7920 3.9203 3.9069 3.8689 3.9745 3.9647 3.9556 3.9254 4.3647 4.0645 4.0301 3.8173 4.0476 3.9524 3.9679 3.9912 3.9433 1.0029 1.0187 1.0124 1.0190 1.0123 1.0457 1.0309 1.0842 1.0031 1.0066 0.9989 1.0120 1.0015 1.0092 1.0105
dispcorr: -0.023061185 hartree
energy: -1769.544307755012
dipole: 9.58255 -9.09236 0.49019 10.28050 -10.57389 -0.29339 12.41073 -11.92459 0.48615
magnitude: 0.75014 au
magnitude: 1.90669 debye
