program: Orca
programVersion: 4.2.1
elementType: Cl F F F O O N N N C C C C C C C C C C C C C C C C C C H H H H H H H H H H H H H H H
charge: 0
multiplicity: 1
keywords: wb97x-d3
keywords: def2-TZVPP
keywords: def2/J RIJCOSX GRIDX6 NOFINALGRIDX
keywords: grid4 nofinalgrid
keywords: scfconv7
keywords: smallprint printgap noloewdin
keywords: NOSOSCF
formula: C18H15ClF3N3O2
InChI: InChI=1S/C18H15ClF3N3O2/c1-17(26,9-25-11-23-10-24-25)15-7-6-14(8-16(15)18(20,21)22)27-13-4-2-12(19)3-5-13/h2-8,10-11,26H,9H2,1H3
42 atoms
Cl -5.938983 -4.453565 -0.136381
F  0.351453 -1.717525 1.77557
F  1.838952 -1.890393 0.257637
F  2.064343 -0.458719 1.872785
O  3.344236 0.261993 -0.355138
O  -3.107135 0.654629 -0.527341
N  4.223511 2.817437 0.560493
N  4.581061 3.972154 -0.012752
N  6.383039 2.901556 0.782782
C  2.548444 1.392789 -0.591206
C  1.046779 1.080304 -0.524074
C  2.855334 2.375699 0.553431
C  2.94775 2.002596 -1.940922
C  0.446645 0.029504 0.195221
C  0.187296 1.954028 -1.189793
C  -0.938035 -0.125384 0.179907
C  -1.185092 1.807252 -1.204841
C  -1.752679 0.748603 -0.521279
C  1.19534 -1.000899 1.019101
C  5.312802 2.187731 1.022997
C  5.882101 3.979689 0.145276
C  -3.715569 -0.564665 -0.431564
C  -4.773387 -0.688775 0.454634
C  -3.341846 -1.636701 -1.23163
C  -5.465424 -1.886025 0.541576
C  -4.025865 -2.836571 -1.135921
C  -5.085454 -2.957446 -0.250035
H  2.229615 3.261491 0.460165
H  2.628718 1.910215 1.511684
H  2.563227 1.401238 -2.766747
H  2.600271 3.023749 -2.079145
H  4.0335 2.034833 -2.01695
H  0.59968 2.789203 -1.737024
H  -1.39744 -0.931185 0.732933
H  3.389581 -0.26699 -1.156313
H  -1.810103 2.507739 -1.742442
H  5.273328 1.231198 1.519291
H  6.492187 4.798182 -0.203653
H  -5.059509 0.153294 1.070623
H  -2.523001 -1.542172 -1.933075
H  -6.29294 -1.984259 1.230005
H  -3.737819 -3.673375 -1.756687
totalener: -1769.51796106 hartree
nucrepener: 2601.43586145 hartree
electener: -4370.95382250 hartree
oneelecener: -7599.27238868 hartree
twoeener: 3228.31856618 hartree
kineticenergy: 1763.81337934 hartree
xcener: -141.169548059265 hartree
chargesum: -0.0000000
charge: -0.074431 -0.174506 -0.171064 -0.165952 -0.346316 -0.297101 0.096507 -0.315588 -0.334957 0.427483 -0.038410 -0.184196 -0.344806 -0.224559 -0.189710 -0.056385 -0.192582 0.206069 0.552836 0.060474 0.058173 0.243427 -0.214167 -0.174654 -0.087419 -0.102783 0.057767 0.127001 0.137919 0.117759 0.095464 0.123084 0.135241 0.142958 0.178694 0.133160 0.147230 0.131643 0.130994 0.135400 0.124788 0.125517
qa: -0.0744 -0.1745 -0.1711 -0.1660 -0.3463 -0.2971 0.0965 -0.3156 -0.3350 0.4275 -0.0384 -0.1842 -0.3448 -0.2246 -0.1897 -0.0564 -0.1926 0.2061 0.5528 0.0605 0.0582 0.2434 -0.2142 -0.1747 -0.0874 -0.1028 0.0578 0.1270 0.1379 0.1178 0.0955 0.1231 0.1352 0.1430 0.1787 0.1332 0.1472 0.1316 0.1310 0.1354 0.1248 0.1255
va: 1.2304 1.1228 1.1246 1.1325 2.0578 2.1148 3.3156 2.8573 3.0603 3.6713 3.5601 3.8670 3.9654 3.9934 4.0176 3.7879 4.1042 3.8522 4.4489 4.0712 4.0546 3.8151 4.0567 3.9749 3.9649 3.9846 3.9526 1.0171 1.0111 0.9978 1.0130 1.0045 1.0019 1.0206 1.0504 1.0127 1.0099 1.0013 1.0119 1.0018 1.0090 1.0102
dispcorr: -0.022050114 hartree
energy: -1769.540011171614
dipole: 12.51348 -13.85423 -1.34074 23.60351 -23.43604 0.16747 -11.91129 10.95477 -0.95652
magnitude: 1.65546 au
magnitude: 4.20786 debye
