program: Orca
programVersion: 4.2.1
elementType: Cl F F F O O N N N C C C C C C C C C C C C C C C C C C H H H H H H H H H H H H H H H
charge: 0
multiplicity: 1
keywords: wb97x-d3
keywords: def2-TZVPP
keywords: def2/J RIJCOSX GRIDX6 NOFINALGRIDX
keywords: grid4 nofinalgrid
keywords: scfconv7
keywords: smallprint printgap noloewdin
keywords: NOSOSCF
formula: C18H15ClF3N3O2
InChI: InChI=1S/C18H15ClF3N3O2/c1-17(26,9-25-11-23-10-24-25)15-7-6-14(8-16(15)18(20,21)22)27-13-4-2-12(19)3-5-13/h2-8,10-11,26H,9H2,1H3
42 atoms
Cl -6.353813 -3.252903 1.477467
F  0.342546 -1.881958 1.561108
F  2.230932 -1.968425 0.576449
F  1.746329 -0.319672 1.903082
O  3.537784 0.31643 0.032652
O  -2.538134 -0.521134 -2.021047
N  3.766178 3.110861 0.59003
N  4.109466 4.209467 -0.092159
N  5.735399 3.637796 1.341812
C  2.71226 1.229373 -0.639982
C  1.3122 0.665651 -0.922881
C  2.534137 2.421202 0.317848
C  3.419763 1.673561 -1.926552
C  0.667459 -0.365413 -0.215283
C  0.58211 1.272621 -1.945639
C  -0.617191 -0.766798 -0.579064
C  -0.69878 0.896448 -2.293034
C  -1.301509 -0.143461 -1.609036
C  1.267033 -1.124239 0.953281
C  4.752112 2.779333 1.435985
C  5.294226 4.489972 0.393483
C  -3.390306 -1.157595 -1.162016
C  -3.737127 -0.602124 0.062319
C  -3.955247 -2.353386 -1.574395
C  -4.647903 -1.252058 0.877533
C  -4.87615 -2.99821 -0.763994
C  -5.214404 -2.447618 0.461276
H  1.84535 3.146908 -0.111035
H  2.10721 2.074234 1.25825
H  3.38705 0.881599 -2.677873
H  3.001644 2.574349 -2.370039
H  4.463613 1.894801 -1.707082
H  1.025034 2.085667 -2.502297
H  -1.096387 -1.577599 -0.05121
H  3.898216 -0.311446 -0.599808
H  -1.224215 1.399308 -3.093873
H  4.705077 1.920949 2.086912
H  5.859055 5.344803 0.055865
H  -3.30421 0.336806 0.382673
H  -3.681338 -2.774744 -2.532343
H  -4.921997 -0.824061 1.831629
H  -5.322606 -3.929101 -1.084623
totalener: -1769.51786967 hartree
nucrepener: 2604.57642918 hartree
electener: -4374.09429885 hartree
oneelecener: -7605.59608920 hartree
twoeener: 3231.50179036 hartree
kineticenergy: 1763.80652973 hartree
xcener: -141.168131433136 hartree
chargesum: -0.0000000
charge: -0.074082 -0.174968 -0.171067 -0.166090 -0.347439 -0.296199 0.095223 -0.314699 -0.334565 0.425596 -0.039176 -0.179943 -0.342202 -0.223327 -0.189641 -0.048751 -0.191809 0.201117 0.551177 0.061114 0.057178 0.233882 -0.172600 -0.205826 -0.104950 -0.092218 0.063595 0.126017 0.135571 0.117620 0.093924 0.122547 0.134423 0.139337 0.179602 0.132388 0.147048 0.131609 0.137873 0.130926 0.126242 0.125546
qa: -0.0741 -0.1750 -0.1711 -0.1661 -0.3474 -0.2962 0.0952 -0.3147 -0.3346 0.4256 -0.0392 -0.1799 -0.3422 -0.2233 -0.1896 -0.0488 -0.1918 0.2011 0.5512 0.0611 0.0572 0.2339 -0.1726 -0.2058 -0.1050 -0.0922 0.0636 0.1260 0.1356 0.1176 0.0939 0.1225 0.1344 0.1393 0.1796 0.1324 0.1470 0.1316 0.1379 0.1309 0.1262 0.1255
va: 1.2305 1.1217 1.1255 1.1319 2.0571 2.1149 3.3189 2.8570 3.0598 3.6795 3.5563 3.8692 3.9637 3.9899 4.0218 3.7737 4.1013 3.8770 4.4525 4.0697 4.0555 3.8239 3.9877 4.0572 3.9839 3.9670 3.9500 1.0172 1.0113 0.9985 1.0140 1.0038 1.0025 1.0226 1.0499 1.0130 1.0098 1.0013 1.0010 1.0115 1.0102 1.0094
dispcorr: -0.022072143 hartree
energy: -1769.539941809188
dipole: 14.60629 -15.60210 -0.99581 19.90740 -20.21714 -0.30974 -16.22999 14.89851 -1.33148
magnitude: 1.69127 au
magnitude: 4.29887 debye
