program: Orca
programVersion: 4.2.1
elementType: Cl F F F O O N N N C C C C C C C C C C C C C C C C C C H H H H H H H H H H H H H H H
charge: 0
multiplicity: 1
keywords: wb97x-d3
keywords: def2-TZVPP
keywords: def2/J RIJCOSX GRIDX6 NOFINALGRIDX
keywords: grid4 nofinalgrid
keywords: scfconv7
keywords: smallprint printgap noloewdin
keywords: NOSOSCF
formula: C18H15ClF3N3O2
InChI: InChI=1S/C18H15ClF3N3O2/c1-17(26,9-25-11-23-10-24-25)15-7-6-14(8-16(15)18(20,21)22)27-13-4-2-12(19)3-5-13/h2-8,10-11,26H,9H2,1H3
42 atoms
Cl -7.590709 -0.901836 -0.152984
F  3.527823 -1.994665 -0.275069
F  3.269403 -0.800195 1.516274
F  2.354321 -2.712275 1.354262
O  3.612046 0.651089 -0.707546
O  -1.930685 -2.363949 -0.445494
N  3.313636 3.201843 0.815835
N  4.610711 2.962099 0.599985
N  4.279547 5.144964 0.950987
C  2.405558 1.333725 -0.553177
C  1.283324 0.295563 -0.488487
C  2.349131 2.126645 0.775803
C  2.240793 2.303026 -1.734025
C  1.396332 -1.001808 0.050829
C  0.029483 0.6718 -0.96251
C  0.289087 -1.843494 0.052034
C  -1.075769 -0.159493 -0.956066
C  -0.936252 -1.438081 -0.450033
C  2.655094 -1.608456 0.647685
C  3.134724 4.511415 1.019777
C  5.151473 4.15553 0.688335
C  -3.234779 -1.966578 -0.377699
C  -3.686517 -1.110917 0.61877
C  -4.12258 -2.494219 -1.301637
C  -5.029433 -0.780429 0.684333
C  -5.468451 -2.172197 -1.229658
C  -5.915714 -1.312042 -0.240243
H  1.362324 2.573862 0.896887
H  2.520649 1.464983 1.623222
H  2.104279 1.747401 -2.661052
H  1.410053 3.001127 -1.625995
H  3.14538 2.901708 -1.842383
H  -0.104304 1.658954 -1.379847
H  0.35635 -2.846011 0.447406
H  4.33567 1.224228 -0.412669
H  -2.01724 0.191738 -1.357007
H  2.169444 4.951477 1.218142
H  6.21089 4.311586 0.560402
H  -2.998163 -0.707931 1.350495
H  -3.761478 -3.163991 -2.070634
H  -5.386546 -0.118397 1.460848
H  -6.163795 -2.58643 -1.946218
totalener: -1769.51935927 hartree
nucrepener: 2578.65037494 hartree
electener: -4348.16973421 hartree
oneelecener: -7553.85309558 hartree
twoeener: 3205.68336137 hartree
kineticenergy: 1763.80518788 hartree
xcener: -141.172025031003 hartree
chargesum: 0.0000000
charge: -0.075799 -0.149877 -0.173036 -0.180704 -0.372455 -0.296571 0.108158 -0.344128 -0.329923 0.426127 0.019358 -0.197557 -0.340925 -0.208103 -0.176372 -0.072599 -0.161900 0.168872 0.542889 0.060250 0.082479 0.240274 -0.172505 -0.206993 -0.109907 -0.091424 0.060584 0.099370 0.144699 0.127881 0.071922 0.107148 0.130622 0.129340 0.207491 0.135924 0.139360 0.137942 0.137061 0.132144 0.125369 0.125513
qa: -0.0758 -0.1499 -0.1730 -0.1807 -0.3725 -0.2966 0.1082 -0.3441 -0.3299 0.4261 0.0194 -0.1976 -0.3409 -0.2081 -0.1764 -0.0726 -0.1619 0.1689 0.5429 0.0602 0.0825 0.2403 -0.1725 -0.2070 -0.1099 -0.0914 0.0606 0.0994 0.1447 0.1279 0.0719 0.1071 0.1306 0.1293 0.2075 0.1359 0.1394 0.1379 0.1371 0.1321 0.1254 0.1255
va: 1.2287 1.1524 1.1237 1.1126 2.0434 2.1108 3.3222 2.8617 3.0606 3.6823 3.5105 3.9418 3.9751 4.0216 3.9928 3.9320 4.0145 3.9009 4.4601 4.0592 4.0262 3.8218 3.9765 4.0491 3.9797 3.9646 3.9470 1.0021 1.0050 1.0063 1.0051 1.0108 1.0016 1.0299 1.0783 1.0051 1.0006 0.9996 1.0016 1.0112 1.0102 1.0091
dispcorr: -0.021657783 hartree
energy: -1769.541017056127
dipole: 4.70520 -5.97908 -1.27388 19.96998 -19.32714 0.64284 -7.78042 7.56354 -0.21688
magnitude: 1.44328 au
magnitude: 3.66852 debye
