program: Gaussian 09
title: 000030574
version: EM64L-G09RevD.01
frameworkgroup: C1[X(C21H33BrO)]
method: RPBEPBE
basis: SDD
operation: Freq
keyword: #p
keyword: freq=noraman
keyword: PBEPBE/SDD
title: #p freq=noraman PBEPBE/SDD
converged: NO YES NO NO
title: Mulliken charges:
elementType: Br O C C C C C C C C C C C C C C C C C C C C C H H H H H H H H H H H H H H H H H H H H H H H H H H H H H H H H H
charge: -0.035636 -0.270755 -0.236038 -0.470110 -0.496055 -0.439316 -0.413278 0.553462 -0.028209 -0.422604 -0.469365 -0.421784 -0.320378 0.434797 -0.408803 -0.091108 -0.365104 -0.385146 -0.436519 -0.354602 -0.732639 -0.738617 -0.698140 0.223882 0.236680 0.208969 0.232483 0.223987 0.209111 0.217152 0.213478 0.215510 0.216494 0.196778 0.183288 0.232476 0.233012 0.193895 0.203513 0.205065 0.223036 0.221360 0.201233 0.191522 0.256778 0.234158 0.194181 0.194019 0.230830 0.219550 0.211904 0.292397 0.293020 0.215360 0.211147 0.209681
chargesum: 0.00000
title: Mulliken charges with hydrogens summed into heavy atoms:
elementType: Br O C C C C C C C C C C C C C C C C C C C C C
charge: -0.035636 -0.270755 -0.012156 -0.024461 -0.039585 -0.013054 0.015710 0.553462 0.188284 -0.190128 -0.236353 -0.041718 0.077030 0.434797 0.019297 0.130252 0.027651 -0.128368 -0.202360 0.033597 -0.070355 -0.153200 -0.061952
polarizability: 3.10492185e+02 3.76319374e+01 2.44834710e+02 -7.25692820e-01 1.06299336e+01 1.96029868e+02
1716.lowfreq: -29.8558 -22.8685 -7.2800 -6.5638 -0.0006 0.0002 0.0009 3.5994 12.4816
frequency: -28.1249 -22.0867 11.6370 22.7646 33.0417 35.0085 41.5122 60.9567 66.7466 69.8185 72.6738 99.2007 110.9295 115.5142 138.9893 144.4118 161.6984 192.3720 205.2503 224.6249 230.9119 245.7190 260.5714 264.1375 277.0145 300.3595 314.4906 375.6611 408.4826 426.4920 436.9303 492.4903 499.7626 527.5704 538.1813 544.8318 587.3369 604.2359 634.5351 655.1619 725.2120 750.5760 755.8651 768.7781 771.2069 782.1464 795.9112 809.1049 829.4436 841.5896 846.5784 860.5996 889.0542 889.1751 912.0355 914.2224 941.4848 948.4111 954.3514 964.9822 973.0190 981.8092 982.5972 984.8286 989.0099 1010.4462 1021.1492 1026.5233 1040.0297 1058.0593 1072.7448 1077.7012 1078.7450 1091.9719 1108.1070 1131.2971 1148.3284 1157.2650 1159.7407 1171.0676 1172.7873 1185.7698 1189.7565 1201.4635 1205.3904 1213.3049 1217.8320 1224.0984 1245.5926 1250.3773 1259.3422 1266.7160 1274.1121 1276.2527 1279.2235 1289.7137 1291.3251 1296.5150 1299.6639 1304.8904 1310.4113 1319.7238 1328.3270 1342.7704 1347.6170 1356.2747 1358.6202 1380.7196 1387.0766 1388.4768 1391.7578 1413.8627 1422.4839 1459.5608 1464.6079 1464.6578 1467.9601 1471.0707 1472.8985 1474.7411 1475.9960 1481.9786 1484.6856 1488.8388 1488.9228 1493.7579 1500.5762 1580.6811 1619.1659 2930.5107 2947.5383 2953.3196 2958.6737 2963.8184 2968.6659 2971.4262 2971.9844 2974.8195 2986.4313 2988.3505 2990.1369 2990.7692 2996.0971 2998.8203 3009.4834 3011.7250 3035.1850 3037.3068 3044.8989 3058.3701 3061.2028 3062.7995 3067.0941 3068.5697 3070.1865 3070.7216 3080.0220 3108.6821 3118.7230 3132.8813 3145.2659 3151.4084
redmass: 2.4607 2.2884 4.2773 3.1308 3.4282 4.7010 3.5257 2.8912 3.4685 2.7390 2.8613 3.3708 2.4429 2.5740 2.7276 3.5961 2.1815 3.0039 3.8883 1.1276 2.8807 1.6692 3.3447 2.2270 3.3191 2.3038 4.0489 4.4040 2.8905 3.1823 3.7761 2.6181 2.1911 2.5458 2.7966 3.5287 2.8908 2.9908 6.3428 4.9240 1.1061 2.7114 1.3980 1.3270 1.6512 2.6065 1.9434 1.7314 2.3218 2.0586 1.9889 1.3177 2.4771 2.0063 2.4229 1.2788 1.7474 2.6442 1.5004 1.6092 1.6802 2.1099 1.7272 1.5889 1.3319 2.9147 2.7325 1.4047 2.6229 2.4181 3.1426 3.8854 2.6455 2.1018 1.4422 1.8094 1.9279 1.7026 1.4059 1.8876 1.4740 1.2597 1.4542 1.5892 1.5228 1.3421 2.0369 1.2021 1.1521 1.2643 1.3380 1.2100 1.3749 1.4221 1.1514 1.0716 1.2939 1.2445 1.2323 1.3948 1.3798 1.3307 1.4914 1.5206 1.4763 1.3850 1.5004 1.6003 1.2179 1.2965 2.9625 2.2955 1.1064 1.0702 1.0832 1.0749 1.0864 1.0687 1.0859 1.0573 1.0507 1.0684 1.0668 1.1136 1.0846 1.0575 2.4451 6.4803 6.3502 1.0569 1.0831 1.0590 1.0592 1.0817 1.0599 1.0828 1.0363 1.0370 1.1001 1.0634 1.0620 1.0748 1.0607 1.0890 1.1002 1.0646 1.1035 1.0994 1.1003 1.0999 1.0564 1.1035 1.0985 1.1007 1.1005 1.0993 1.1047 1.0870 1.0870 1.0960 1.0959 1.1103
irintensity: 0.0596 0.0110 0.0661 0.0204 0.0937 0.1792 0.2713 0.1516 0.0741 0.4809 0.0995 0.7841 0.1878 0.5055 0.6289 0.1946 0.7681 3.8762 0.4767 0.0829 1.0526 0.6631 1.1827 1.2344 4.2407 0.1414 1.3512 2.8760 0.4535 0.4724 2.6201 2.5005 2.9382 4.3314 19.0356 9.1261 35.9444 29.1786 5.3972 23.4023 9.6612 4.8682 7.0729 4.5637 9.9665 5.1322 2.1078 2.1797 14.6973 15.7351 11.1063 9.7983 4.8797 7.8476 2.1110 2.3720 2.3162 13.8691 1.0266 2.6413 0.1695 3.1239 9.0886 5.3462 1.4494 32.8993 104.7546 2.2661 0.4294 2.6044 49.4861 1.3762 25.9995 20.1928 3.8443 1.7943 1.8931 1.7066 8.6931 1.1606 1.5815 11.5250 2.2503 9.5350 5.4631 2.3050 3.2221 12.3266 0.5484 1.3223 2.4241 1.5936 9.1705 0.7464 1.6566 1.2636 2.9224 5.1218 0.3283 2.3996 4.5404 12.2700 0.2852 4.6280 2.3583 0.6736 0.5358 0.8486 12.2723 13.6935 3.9731 9.0114 11.4278 0.2694 4.6649 3.9051 2.6756 13.7630 9.8342 6.4123 7.8093 5.1921 17.5109 7.7644 3.8219 12.3921 23.1307 0.9937 13.7066 29.6137 34.6180 18.7105 2.5517 1.0172 84.2805 13.9414 39.3864 30.4686 18.8030 32.6104 27.5652 20.7539 65.1660 41.8681 22.1102 47.9746 76.9357 11.5766 14.9270 25.8625 11.4402 20.6979 45.0766 89.4545 99.7862 36.9027 96.7645 13.2425 16.4538 27.3953 4.5343 5.0419
temp: 298.150 k
press: 1.00000 atm
elementType: 35 8 6 6 6 6 6 6 6 6 6 6 6 6 6 6 6 6 6 6 6 6 6 1 1 1 1 1 1 1 1 1 1 1 1 1 1 1 1 1 1 1 1 1 1 1 1 1 1 1 1 1 1 1 1 1
symmnumber: 1
zpe: 1286915.3 jmol-1
zpe.correction: 0.490160 hartree
zpe.thermalcorrener: 0.514822 hartree
zpe.thermalcorrenthalpy: 0.515766 hartree
zpe.thermalcorrgfe: 0.431150 hartree
zpe.sumelectzpe: -906.907217 hartree
zpe.sumelectthermal: -906.882555 hartree
zpe.sumelectthermalent: -906.881611 hartree
zpe.sumelectthermalfe: -906.966227 hartree
dipole: -2.9474 -2.8001 1.1059
dipole: 4.2132
quadrupole: -143.4298 -163.0283 -147.2252
quadrupole: -5.0508 0.9265 3.8708
quadrupole: 7.7979 -11.8005 4.0026 -5.0508 0.9265 3.8708
hfenergy: -907.3973771 hartree
pointgroup: C01 [X(C21H33Br1O1)]
dipole: 1.0167513 1.2383038 0.4247675 debye
polarizability: 300.8462943|44.4187023|253.9334823|2.6984224|-11.0156237|196.5769863 unknown
InChI: InChI=1S/C21H33BrO/c1-3-5-8-17(4-2)16-23-21(15-22)20-13-11-19(12-14-20)18-9-6-7-10-18/h11-14,17-18,21H,3-10,15-16H2,1-2H3
charge 0 multiplicity 1
56 atoms
Br -1.550834 -5.126507 -0.124943
O  -1.563698 -1.80804 -0.254872
C  4.431967 0.918082 0.578002
C  5.472896 0.567367 -0.525721
C  4.209332 2.454306 0.371911
C  6.451454 1.764625 -0.482524
C  5.536688 3.008359 -0.247926
C  3.164536 0.07604 0.554978
C  -3.377336 -0.172729 -0.329347
C  2.31716 0.049654 -0.58649
C  2.792201 -0.711989 1.673304
C  -4.208224 0.815938 0.534637
C  -2.220302 -0.735796 0.515539
C  0.791568 -1.530747 0.509867
C  -2.87666 0.427187 -1.674637
C  -0.449422 -2.430995 0.460251
C  -5.472649 1.365511 -0.163353
C  1.151855 -0.741338 -0.612023
C  1.622192 -1.504027 1.65436
C  -6.338893 2.242115 0.770225
C  -2.005926 1.698883 -1.550179
C  -0.102658 -3.714202 -0.302119
C  -7.598592 2.80181 0.074894
H  4.928988 0.771922 1.558819
H  5.961826 -0.407737 -0.35136
H  4.969592 0.515972 -1.511361
H  3.360555 2.618706 -0.317152
H  3.94604 2.948867 1.323748
H  7.149521 1.640715 0.367944
H  7.062667 1.852914 -1.398269
H  5.326766 3.521116 -1.204394
H  6.024011 3.747775 0.412209
H  -4.030824 -1.034453 -0.582776
H  -3.570762 1.665886 0.85609
H  -4.518875 0.296694 1.466037
H  2.57306 0.653797 -1.465681
H  3.424806 -0.700798 2.56953
H  -2.611918 -1.161473 1.465849
H  -1.482524 0.055824 0.767136
H  -3.753653 0.649684 -2.312984
H  -2.302993 -0.36003 -2.199351
H  -0.755786 -2.689405 1.498002
H  -5.186282 1.962579 -1.052446
H  -6.083063 0.517894 -0.539484
H  0.498224 -0.742843 -1.492137
H  1.353272 -2.100149 2.536044
H  -5.723538 3.081192 1.155177
H  -6.63815 1.645153 1.656018
H  -1.091221 1.51276 -0.957742
H  -2.556115 2.529434 -1.070409
H  -1.686834 2.047325 -2.549967
H  0.806195 -4.188614 0.094952
H  -0.011265 -3.522961 -1.382142
H  -8.199048 3.424348 0.763589
H  -8.245987 1.982767 -0.291375
H  -7.326541 3.42783 -0.795948
