program: Gaussian 09
title: 000030447
version: EM64L-G09RevD.01
frameworkgroup: C1[X(C4H9N)]
method: RPBEPBE
basis: SDD
operation: Freq
keyword: #p
keyword: freq=noraman
keyword: PBEPBE/SDD
title: #p freq=noraman PBEPBE/SDD
converged: YES YES NO NO
title: Mulliken charges:
elementType: N C C C C H H H H H H H H H
charge: -0.539767 -0.462789 -0.170987 -0.158575 -0.728611 0.213312 0.214626 0.221338 0.214640 0.221050 0.221151 0.223176 0.265403 0.266031
chargesum: 0.00000
title: Mulliken charges with hydrogens summed into heavy atoms:
elementType: N C C C C
charge: -0.008332 -0.034851 0.050352 0.056065 -0.063234
polarizability: 7.28912336e+01 -3.40834184e+00 4.22796852e+01 5.98990131e+00 -3.39025386e+00 4.28131127e+01
1716.lowfreq: -17.8051 -8.6568 -0.0005 -0.0001 0.0005 24.4586 97.0771 168.5062 198.9149
frequency: 97.0332 168.4949 198.8933 220.6010 294.0544 416.5658 479.4125 634.4069 761.2081 859.3110 924.1106 975.0927 1043.0072 1047.9148 1059.6702 1093.6101 1169.6140 1278.1244 1289.8786 1329.0914 1339.3283 1392.8659 1456.1705 1462.0784 1472.0099 1641.4877 1680.5964 2963.3724 2983.3406 3037.4998 3038.1170 3062.9428 3072.8938 3086.5026 3446.1699 3574.5116
redmass: 2.1865 1.7516 1.4465 1.2834 1.6438 2.5713 2.3816 1.4968 1.4281 1.5082 1.4104 1.0803 1.5632 3.8678 1.6331 2.8291 1.7492 1.2727 1.2480 1.1860 1.2686 1.2376 1.0807 1.0474 1.0572 1.0893 5.9046 1.0364 1.0601 1.0970 1.1016 1.0925 1.0942 1.0942 1.0446 1.0974
irintensity: 0.3961 0.0674 4.5839 36.0286 31.6808 10.9265 10.9018 312.4836 0.2655 5.4605 20.9477 60.2382 1.0868 9.4255 4.3174 6.8379 1.5676 0.7198 0.3567 2.8256 3.5890 10.7491 11.0793 13.4941 17.4945 30.4879 2.0224 40.5499 46.0270 31.1511 19.8619 3.1494 15.8548 81.4383 1.7578 0.5743
temp: 298.150 k
press: 1.00000 atm
elementType: 7 6 6 6 6 1 1 1 1 1 1 1 1 1
symmnumber: 1
zpe: 323290.7 jmol-1
zpe.correction: 0.123135 hartree
zpe.thermalcorrener: 0.129966 hartree
zpe.thermalcorrenthalpy: 0.130910 hartree
zpe.thermalcorrgfe: 0.093239 hartree
zpe.sumelectzpe: -212.124505 hartree
zpe.sumelectthermal: -212.117674 hartree
zpe.sumelectthermalent: -212.116729 hartree
zpe.sumelectthermalfe: -212.154400 hartree
dipole: -1.2006 -0.9718 0.2455
dipole: 1.5640
quadrupole: -35.9910 -30.5075 -31.0032
quadrupole: -2.7751 2.5538 -0.9869
quadrupole: -3.4904 1.9930 1.4974 -2.7751 2.5538 -0.9869
hfenergy: -212.2476396 hartree
pointgroup: C01 [X(C4H9N1)]
dipole: 0.4763062 0.3339965 0.2005183 debye
dipolederiv: -1.0606907 0.033651 -0.155974 -0.0473319 -0.407879 -0.0271512 -0.2969458 -0.0179033 -0.2407058 0.5186755 -0.0938697 0.0196111 -0.0361937 0.4238748 -0.0453518 0.090395 -0.005753 0.2036576 -0.0845538 0.0733352 -0.0349529 0.0329151 -0.2378526 0.1774563 -0.0269655 0.1978941 0.0008289 0.1469224 0.0937369 -0.053726 0.1227691 -0.1196892 0.1719915 0.0356825 0.1748926 0.0156685 -0.1491849 -0.0611945 -0.0190039 -0.0522191 0.0877201 -0.0428244 0.0551478 -0.0377244 0.0697109 0.0208921 0.0629289 0.031092 0.0167892 -0.0189099 -0.0967739 -0.0104887 -0.1493535 -0.0848716 -0.0615681 -0.0527971 0.0675211 -0.045985 -0.0086902 0.0935147 0.0533765 0.1441832 -0.0398293 0.0450174 -0.0369721 -0.0116484 -0.0603913 0.0648569 -0.1492439 -0.0137791 -0.1423781 -0.0639063 0.0252356 -0.0537487 -0.0402685 -0.0406772 0.0589989 -0.1472046 -0.03204 -0.1458687 -0.0594926 -0.0117685 -0.0558505 0.0553005 -0.1333963 0.0210836 0.1085547 0.0623626 0.1212384 -0.0401049 0.0688662 0.016376 0.0413823 -0.036987 0.0276001 -0.1125092 -0.043952 -0.1295719 -0.0865901 -0.0849671 0.0993559 -0.014783 0.130151 -0.0477731 0.0240848 -0.0646655 0.0042652 0.1169695 0.256501 -0.0546477 0.1457226 0.0299539 0.0538547 0.1129186 0.1306583 0.0632654 0.1783896 0.3706229 0.0296964 -0.0302728 0.1206035 0.1028049 -0.0674617 0.0612139 -0.0771858 0.0302757 unknown
polarizability: 72.80509|-1.8340402|40.4883574|-6.8052709|2.7530029|44.6905841 unknown
InChI: InChI=1S/C4H9N/c1-2-3-4-5/h2-3H,4-5H2,1H3
charge 0 multiplicity 1
14 atoms
N  -2.345888 0.534674 -0.16735
C  -1.338268 -0.534833 0.050317
C  0.048185 -0.030291 0.425058
C  1.170231 -0.238367 -0.314756
C  2.550741 0.281515 0.0190
H  -1.271283 -1.147357 -0.869046
H  -1.735634 -1.199011 0.84239
H  0.113997 0.56839 1.348406
H  1.083639 -0.836599 -1.236611
H  2.944616 0.924707 -0.79263
H  2.545319 0.871548 0.952708
H  3.272121 -0.549991 0.143037
H  -2.051787 1.226076 -0.865836
H  -2.661489 0.98844 0.696413
