program: Orca
programVersion: 4.2.1
elementType: Cl O N N N C C C C C C C C C C C C C C C C C C H H H H H H H H H H H H H H H H H H H H H H H H
charge: 0
multiplicity: 1
keywords: wb97x-d3
keywords: def2-TZVPP
keywords: def2/J RIJCOSX GRIDX6 NOFINALGRIDX
keywords: grid4 nofinalgrid
keywords: scfconv7
keywords: smallprint printgap noloewdin
keywords: NOSOSCF
formula: C18H24ClN3O
InChI: InChI=1S/C18H24ClN3O/c1-13(2)17-8-5-15(9-14-3-6-16(19)7-4-14)18(17,23)10-22-12-20-11-21-22/h3-4,6-7,11-13,15,17,23H,5,8-10H2,1-2H3
47 atoms
Cl 5.153659 0.371899 0.828486
O  -1.342018 -0.297813 1.267798
N  -0.023655 -1.950568 -0.774865
N  0.798541 -1.925573 0.281153
N  1.963648 -2.2631 -1.600031
C  -1.844287 -0.402077 -0.042955
C  -3.39933 -0.34293 -0.047836
C  -1.388327 0.768326 -0.987311
C  -3.682933 0.194265 -1.451783
C  -2.681306 1.325796 -1.599348
C  -3.989267 0.515861 1.098035
C  -1.450154 -1.771641 -0.624926
C  -0.565601 1.875144 -0.321401
C  -5.332935 1.147622 0.742419
C  -4.172846 -0.326918 2.359272
C  0.860811 1.511896 -0.01431
C  0.687647 -2.140232 -1.884555
C  1.755151 1.259893 -1.052993
C  1.335528 1.427626 1.291365
C  3.07483 0.920782 -0.805618
C  2.653687 1.087848 1.561359
C  1.975188 -2.107284 -0.265136
C  3.511713 0.832008 0.506202
H  -3.814348 -1.352718 0.058975
H  -0.785674 0.352437 -1.802067
H  -4.717189 0.497788 -1.605184
H  -3.483473 -0.582058 -2.195916
H  -2.539666 1.65372 -2.62992
H  -3.019718 2.199077 -1.032203
H  -3.301235 1.335404 1.328828
H  -1.889624 -1.919949 -1.609706
H  -1.828407 -2.563964 0.023121
H  -1.069035 2.223257 0.582336
H  -0.559537 2.725232 -1.010426
H  -0.417014 -0.584396 1.269348
H  -5.747217 1.657577 1.614334
H  -5.257405 1.891316 -0.051524
H  -6.062338 0.396385 0.429596
H  -4.503098 0.289527 3.197848
H  -3.259382 -0.834309 2.66087
H  -4.937134 -1.091855 2.197342
H  0.239584 -2.199944 -2.86379
H  1.420857 1.328247 -2.08155
H  0.669116 1.630457 2.120557
H  3.750035 0.723139 -1.62689
H  3.000431 1.021361 2.583765
H  2.873864 -2.14777 0.32931
elementType: Cl O N C H
totalener: -1400.15532393 hartree
nucrepener: 2223.16864073 hartree
electener: -3623.32396466 hartree
oneelecener: -6330.89440329 hartree
twoeener: 2707.57043863 hartree
cpcmener: -0.02764341 hartree
kineticenergy: 1395.25924378 hartree
xcener: -114.445047552720 hartree
chargesum: -0.0000000
charge: -0.112465 -0.430276 0.125275 -0.365725 -0.407739 0.336131 0.017110 -0.032698 -0.184597 -0.198972 0.013946 -0.194848 -0.108712 -0.322394 -0.319622 0.038203 0.047069 -0.231485 -0.235353 -0.134963 -0.130595 0.086762 0.075006 0.073918 0.088222 0.084721 0.088977 0.085406 0.084054 0.053579 0.125565 0.128776 0.096126 0.110889 0.215723 0.093100 0.087352 0.092237 0.091581 0.094334 0.081547 0.179604 0.137994 0.146218 0.136119 0.142960 0.151941
qa: -0.1125 -0.4303 0.1253 -0.3657 -0.4077 0.3361 0.0171 -0.0327 -0.1846 -0.1990 0.0139 -0.1948 -0.1087 -0.3224 -0.3196 0.0382 0.0471 -0.2315 -0.2354 -0.1350 -0.1306 0.0868 0.0750 0.0739 0.0882 0.0847 0.0890 0.0854 0.0841 0.0536 0.1256 0.1288 0.0961 0.1109 0.2157 0.0931 0.0874 0.0922 0.0916 0.0943 0.0815 0.1796 0.1380 0.1462 0.1361 0.1430 0.1519
va: 1.1913 1.9871 3.3316 2.8441 2.9992 3.8830 3.8130 3.7732 3.9582 3.9607 3.7764 3.9602 3.8170 3.9442 3.9069 3.4967 4.0680 3.9203 3.9516 3.9163 3.9775 4.0199 3.7645 1.0009 1.0082 1.0093 1.0098 1.0170 1.0000 1.0199 0.9982 1.0018 1.0100 1.0031 1.0694 1.0058 0.9999 0.9981 1.0042 1.0294 1.0020 0.9916 1.0051 1.0093 1.0116 1.0045 0.9985
dispcorr: -0.030741611 hartree
energy: -1400.186065541506
dipole: -49.49199 47.20119 -2.29080 5.79458 -5.59115 0.20343 -1.32023 -0.11463 -1.43486
magnitude: 2.71072 au
magnitude: 6.89010 debye
