program: Orca
programVersion: 4.2.1
elementType: Cl O N N N C C C C C C C C C C C C C C C C C C H H H H H H H H H H H H H H H H H H H H H H H H
charge: 0
multiplicity: 1
keywords: wb97x-d3
keywords: def2-TZVPP
keywords: def2/J RIJCOSX GRIDX6 NOFINALGRIDX
keywords: grid4 nofinalgrid
keywords: scfconv7
keywords: smallprint printgap noloewdin
keywords: NOSOSCF
formula: C18H24ClN3O
InChI: InChI=1S/C18H24ClN3O/c1-13(2)17-8-5-15(9-14-3-6-16(19)7-4-14)18(17,23)10-22-12-20-11-21-22/h3-4,6-7,11-13,15,17,23H,5,8-10H2,1-2H3
47 atoms
Cl 5.428546 3.103405 -0.892142
O  -2.242624 0.013745 2.085375
N  -0.971151 -2.746284 0.071127
N  0.32597 -2.759574 -0.251764
N  -0.841892 -4.048638 -1.668129
C  -1.781115 -0.496971 0.847016
C  -2.796476 -0.259059 -0.302167
C  -0.529205 0.267844 0.372809
C  -2.376553 1.097935 -0.930877
C  -1.108687 1.553813 -0.202339
C  -4.291114 -0.284666 0.055311
C  -1.490655 -1.971365 1.173058
C  0.544077 0.464704 1.44037
C  -5.120737 -0.147992 -1.220986
C  -4.754285 -1.529381 0.805137
C  1.770693 1.125756 0.879719
C  -1.647761 -3.515511 -0.782086
C  2.023355 2.478078 1.087803
C  2.674943 0.398562 0.107883
C  3.142742 3.095938 0.547264
C  3.799488 0.995712 -0.439819
C  0.350404 -3.548599 -1.294851
C  4.022972 2.3455 -0.213947
H  -2.630058 -1.039588 -1.05359
H  -0.091329 -0.296337 -0.456476
H  -3.168732 1.843003 -0.839795
H  -2.185159 0.978845 -1.997414
H  -0.407963 2.067883 -0.860356
H  -1.348263 2.260835 0.599862
H  -4.504463 0.586195 0.68644
H  -2.393077 -2.471478 1.518302
H  -0.768543 -2.033994 1.987214
H  0.824446 -0.502342 1.866127
H  0.148082 1.067243 2.260037
H  -2.452483 0.948575 1.985726
H  -4.875617 0.748083 -1.792004
H  -4.966397 -1.007833 -1.877972
H  -6.185999 -0.101173 -0.988265
H  -4.531918 -2.443648 0.248707
H  -5.836983 -1.501669 0.943488
H  -4.31278 -1.615059 1.796131
H  -2.71238 -3.675169 -0.712869
H  1.338666 3.066922 1.686021
H  2.500268 -0.656432 -0.068302
H  3.322413 4.147863 0.723123
H  4.492882 0.413572 -1.03142
H  1.272598 -3.778733 -1.805155
elementType: Cl O N C H
totalener: -1400.15807520 hartree
nucrepener: 2116.78796906 hartree
electener: -3516.94604426 hartree
oneelecener: -6117.50481894 hartree
twoeener: 2600.55877468 hartree
cpcmener: -0.02920982 hartree
kineticenergy: 1395.26516253 hartree
xcener: -114.440353422304 hartree
chargesum: 0.0000000
charge: -0.108913 -0.454974 0.151939 -0.384477 -0.422711 0.495253 -0.175198 -0.027208 -0.186694 -0.221541 0.081966 -0.257454 -0.084489 -0.304227 -0.329402 0.017822 0.051934 -0.216388 -0.220110 -0.151265 -0.171213 0.085071 0.098090 0.098964 0.089656 0.080681 0.094290 0.082268 0.078868 0.032004 0.163299 0.141753 0.101771 0.088794 0.221813 0.092334 0.084095 0.094343 0.083775 0.102625 0.089827 0.181020 0.137788 0.146521 0.144194 0.142551 0.160955
qa: -0.1089 -0.4550 0.1519 -0.3845 -0.4227 0.4953 -0.1752 -0.0272 -0.1867 -0.2215 0.0820 -0.2575 -0.0845 -0.3042 -0.3294 0.0178 0.0519 -0.2164 -0.2201 -0.1513 -0.1712 0.0851 0.0981 0.0990 0.0897 0.0807 0.0943 0.0823 0.0789 0.0320 0.1633 0.1418 0.1018 0.0888 0.2218 0.0923 0.0841 0.0943 0.0838 0.1026 0.0898 0.1810 0.1378 0.1465 0.1442 0.1426 0.1610
va: 1.1964 1.9984 3.2651 2.8140 3.0346 3.7139 3.8922 3.8243 3.9760 4.0327 3.7812 3.8929 3.7310 3.9428 3.9163 3.5183 4.0602 3.9845 3.9677 3.9866 4.0271 4.0023 3.8031 1.0100 1.0330 1.0082 1.0014 1.0126 1.0113 1.0215 0.9866 1.0075 1.0252 1.0336 1.0211 1.0062 1.0004 1.0049 1.0001 1.0064 1.0278 0.9919 1.0074 1.0179 1.0051 1.0075 0.9936
dispcorr: -0.027398146 hartree
energy: -1400.185473343085
dipole: -44.68156 42.62541 -2.05615 -6.91681 7.63743 0.72062 3.74384 -2.98358 0.76026
magnitude: 2.30760 au
magnitude: 5.86546 debye
