program: Orca
programVersion: 4.2.1
elementType: Cl O N N N C C C C C C C C C C C C C C C C C C H H H H H H H H H H H H H H H H H H H H H H H H
charge: 0
multiplicity: 1
keywords: wb97x-d3
keywords: def2-TZVPP
keywords: def2/J RIJCOSX GRIDX6 NOFINALGRIDX
keywords: grid4 nofinalgrid
keywords: scfconv7
keywords: smallprint printgap noloewdin
keywords: NOSOSCF
formula: C18H24ClN3O
InChI: InChI=1S/C18H24ClN3O/c1-13(2)17-8-5-15(9-14-3-6-16(19)7-4-14)18(17,23)10-22-12-20-11-21-22/h3-4,6-7,11-13,15,17,23H,5,8-10H2,1-2H3
47 atoms
Cl 4.848932 4.778633 -0.347624
O  -0.945861 -1.451977 1.416475
N  -1.267804 -3.391951 -0.714493
N  -2.280084 -3.575207 -1.567844
N  -2.334629 -5.128291 0.048869
C  -0.923265 -1.060462 0.05894
C  -2.293932 -0.518456 -0.469717
C  0.042675 0.135401 -0.067776
C  -2.088687 0.99999 -0.657636
C  -0.853771 1.346043 0.161632
C  -3.53429 -0.889384 0.368442
C  -0.405857 -2.232868 -0.786185
C  1.287632 0.065306 0.818095
C  -3.728528 -0.057751 1.636549
C  -4.786046 -0.795916 -0.49911
C  2.206743 1.223635 0.55328
C  -1.320929 -4.317763 0.244544
C  2.176384 2.360119 1.356575
C  3.078932 1.210254 -0.532485
C  2.983134 3.456627 1.089527
C  3.895269 2.294753 -0.816596
C  -2.885343 -4.622872 -1.070064
C  3.83678 3.413612 -0.000573
H  -2.458981 -0.965868 -1.452146
H  0.374101 0.168398 -1.114132
H  -2.963246 1.591392 -0.384874
H  -1.889682 1.214992 -1.709936
H  -0.38897 2.282251 -0.14948
H  -1.098025 1.441446 1.224417
H  -3.457477 -1.946274 0.660871
H  0.585748 -2.535996 -0.446851
H  -0.321702 -1.948082 -1.83336
H  1.823636 -0.870706 0.636605
H  0.99851 0.067063 1.869889
H  -1.760989 -1.9251 1.610637
H  -3.968876 0.980106 1.399351
H  -4.564062 -0.450557 2.218187
H  -2.854944 -0.049333 2.286577
H  -4.724755 -1.471182 -1.353907
H  -4.933667 0.216654 -0.881741
H  -5.678164 -1.062681 0.070148
H  -0.596905 -4.383064 1.040992
H  1.510022 2.396718 2.209781
H  3.128619 0.337185 -1.172382
H  2.943252 4.330161 1.726067
H  4.567985 2.264176 -1.662935
H  -3.757396 -5.047193 -1.54244
elementType: Cl O N C H
totalener: -1400.15856493 hartree
nucrepener: 2092.08637726 hartree
electener: -3492.24494219 hartree
oneelecener: -6067.92712470 hartree
twoeener: 2575.68218252 hartree
cpcmener: -0.02942471 hartree
kineticenergy: 1395.26906741 hartree
xcener: -114.439436204038 hartree
chargesum: 0.0000000
charge: -0.108077 -0.438276 0.117090 -0.356798 -0.414739 0.362563 -0.038615 0.007807 -0.200427 -0.227372 0.010484 -0.159331 -0.099536 -0.305900 -0.301724 0.031233 0.039065 -0.224783 -0.227392 -0.148153 -0.155666 0.062198 0.091832 0.078724 0.089917 0.088472 0.092969 0.088490 0.085824 0.026519 0.132880 0.117756 0.101432 0.087225 0.230043 0.087302 0.103803 0.085989 0.086395 0.088915 0.094355 0.181781 0.141196 0.143781 0.144373 0.144520 0.161858
qa: -0.1081 -0.4383 0.1171 -0.3568 -0.4147 0.3626 -0.0386 0.0078 -0.2004 -0.2274 0.0105 -0.1593 -0.0995 -0.3059 -0.3017 0.0312 0.0391 -0.2248 -0.2274 -0.1482 -0.1557 0.0622 0.0918 0.0787 0.0899 0.0885 0.0930 0.0885 0.0858 0.0265 0.1329 0.1178 0.1014 0.0872 0.2300 0.0873 0.1038 0.0860 0.0864 0.0889 0.0944 0.1818 0.1412 0.1438 0.1444 0.1445 0.1619
va: 1.1976 1.9916 3.3630 2.8762 3.0260 3.8314 3.8102 3.7567 3.9795 3.9932 3.8802 3.9394 3.8084 3.9094 3.9234 3.5034 4.0570 3.9620 3.9902 3.9804 3.9837 4.0350 3.8125 1.0256 1.0184 1.0118 1.0046 1.0150 1.0049 1.0211 0.9977 1.0145 1.0164 1.0299 1.0179 1.0001 1.0046 1.0256 1.0093 1.0028 1.0038 1.0001 1.0054 1.0040 1.0046 1.0049 0.9965
dispcorr: -0.027171238 hartree
energy: -1400.185736172278
dipole: -34.52666 34.38465 -0.14201 -11.25013 11.43713 0.18700 3.58761 -3.60723 -0.01962
magnitude: 0.23563 au
magnitude: 0.59893 debye
