program: Orca
programVersion: 4.2.1
elementType: Cl O N N N C C C C C C C C C C C C C C C C C C H H H H H H H H H H H H H H H H H H H H H H H H
charge: 0
multiplicity: 1
keywords: wb97x-d3
keywords: def2-TZVPP
keywords: def2/J RIJCOSX GRIDX6 NOFINALGRIDX
keywords: grid4 nofinalgrid
keywords: scfconv7
keywords: smallprint printgap noloewdin
keywords: NOSOSCF
formula: C18H24ClN3O
InChI: InChI=1S/C18H24ClN3O/c1-13(2)17-8-5-15(9-14-3-6-16(19)7-4-14)18(17,23)10-22-12-20-11-21-22/h3-4,6-7,11-13,15,17,23H,5,8-10H2,1-2H3
47 atoms
Cl 5.320683 0.958466 1.131706
O  -1.624041 1.281066 1.178304
N  -0.200543 -1.869024 0.043737
N  -1.030186 -2.909136 -0.071051
N  0.846525 -3.28173 -1.231841
C  -1.51994 0.270344 0.193963
C  -2.888453 -0.358778 -0.140252
C  -1.066893 0.843509 -1.17635
C  -3.529439 0.691901 -1.044384
C  -2.378034 1.144713 -1.947455
C  -3.739567 -0.886895 1.026642
C  -0.525699 -0.709106 0.838617
C  -0.152976 2.073517 -1.126242
C  -4.574821 0.169455 1.746211
C  -4.648394 -2.010002 0.532085
C  1.215279 1.826419 -0.55622
C  0.915759 -2.10938 -0.649064
C  1.545245 2.187756 0.747458
C  2.193407 1.203497 -1.329431
C  2.802302 1.926361 1.273397
C  3.455465 0.93218 -0.822604
C  -0.36546 -3.726885 -0.846993
C  3.748002 1.293942 0.483029
H  -2.667192 -1.217984 -0.782667
H  -0.531949 0.053607 -1.712115
H  -3.918561 1.534894 -0.46506
H  -4.375053 0.296727 -1.608925
H  -2.389911 0.596926 -2.890804
H  -2.459448 2.203174 -2.202704
H  -3.064077 -1.33211 1.765824
H  -0.920064 -1.058751 1.793485
H  0.410912 -0.196366 1.053156
H  -0.644009 2.883885 -0.583078
H  -0.041335 2.429933 -2.154098
H  -2.274961 1.933761 0.900243
H  -5.341974 0.594064 1.09443
H  -5.094233 -0.277692 2.596489
H  -3.975898 0.991436 2.136741
H  -4.064041 -2.83394 0.118758
H  -5.332117 -1.661805 -0.246654
H  -5.259117 -2.413159 1.342794
H  1.741188 -1.415162 -0.689842
H  0.808032 2.673334 1.373623
H  1.972227 0.922395 -2.352784
H  3.036254 2.213233 2.289935
H  4.198587 0.447235 -1.441521
H  -0.767211 -4.683711 -1.143172
elementType: Cl O N C H
totalener: -1400.16588196 hartree
nucrepener: 2176.97385175 hartree
electener: -3577.13973371 hartree
oneelecener: -6237.82651275 hartree
twoeener: 2660.68677904 hartree
cpcmener: -0.02334037 hartree
kineticenergy: 1395.23748731 hartree
xcener: -114.436181249784 hartree
chargesum: -0.0000000
charge: -0.102285 -0.419617 0.154111 -0.377697 -0.412785 0.424964 -0.066682 -0.072446 -0.208785 -0.156579 0.045588 -0.259649 -0.125472 -0.319425 -0.311869 0.105954 0.038660 -0.241968 -0.317238 -0.125135 -0.119851 0.084363 0.083621 0.080502 0.101254 0.080858 0.083127 0.088591 0.077468 0.039251 0.141923 0.145392 0.094802 0.107561 0.213267 0.081500 0.096843 0.091143 0.089127 0.084587 0.090994 0.181300 0.132655 0.147608 0.143412 0.147214 0.159842
qa: -0.1023 -0.4196 0.1541 -0.3777 -0.4128 0.4250 -0.0667 -0.0724 -0.2088 -0.1566 0.0456 -0.2596 -0.1255 -0.3194 -0.3119 0.1060 0.0387 -0.2420 -0.3172 -0.1251 -0.1199 0.0844 0.0836 0.0805 0.1013 0.0809 0.0831 0.0886 0.0775 0.0393 0.1419 0.1454 0.0948 0.1076 0.2133 0.0815 0.0968 0.0911 0.0891 0.0846 0.0910 0.1813 0.1327 0.1476 0.1434 0.1472 0.1598
va: 1.2039 2.0293 3.2804 2.8228 3.0431 3.8358 3.8093 3.8563 4.0047 3.9472 3.7781 3.9311 3.8277 3.9238 3.9246 3.3970 4.0597 3.9859 3.9756 3.9687 3.9079 4.0042 3.8327 1.0326 1.0079 1.0047 1.0148 1.0051 1.0113 1.0279 1.0081 0.9984 1.0145 1.0047 1.0252 0.9955 1.0048 1.0223 1.0125 1.0010 1.0045 1.0005 1.0304 1.0043 1.0050 1.0033 0.9939
dispcorr: -0.029209960 hartree
energy: -1400.195091921851
dipole: -45.69841 44.30351 -1.39490 1.11148 0.53172 1.64320 -3.58021 3.16371 -0.41650
magnitude: 2.19530 au
magnitude: 5.58000 debye
