program: Orca
programVersion: 4.2.1
elementType: Cl O N N N C C C C C C C C C C C C C C C C C C H H H H H H H H H H H H H H H H H H H H H H H H
charge: 0
multiplicity: 1
keywords: wb97x-d3
keywords: def2-TZVPP
keywords: def2/J RIJCOSX GRIDX6 NOFINALGRIDX
keywords: grid4 nofinalgrid
keywords: scfconv7
keywords: smallprint printgap noloewdin
keywords: NOSOSCF
formula: C18H24ClN3O
InChI: InChI=1S/C18H24ClN3O/c1-13(2)17-8-5-15(9-14-3-6-16(19)7-4-14)18(17,23)10-22-12-20-11-21-22/h3-4,6-7,11-13,15,17,23H,5,8-10H2,1-2H3
47 atoms
Cl 5.529102 2.237867 0.846757
O  -0.410956 -0.222041 0.746164
N  -0.783036 -2.7629 -0.748179
N  -0.379583 -3.083962 0.484808
N  -1.506766 -4.783521 -0.425515
C  -1.070789 -0.302864 -0.490321
C  -2.63205 -0.43484 -0.37903
C  -0.820571 1.002344 -1.299781
C  -3.184459 0.890417 -0.908763
C  -2.16851 1.278201 -1.970975
C  -3.198965 -0.901781 0.97166
C  -0.484786 -1.463891 -1.311094
C  -0.362223 2.194131 -0.442142
C  -3.244706 0.179109 2.048656
C  -4.595032 -1.489748 0.775486
C  1.103486 2.188675 -0.099546
C  -1.454964 -3.784748 -1.277288
C  1.560169 2.026159 1.204724
C  2.052779 2.375063 -1.102737
C  2.914269 2.043102 1.505344
C  3.411681 2.390349 -0.826034
C  -0.837516 -4.303031 0.636557
C  3.832208 2.220789 0.482975
H  -2.930342 -1.195805 -1.111889
H  -0.051229 0.833284 -2.060694
H  -3.212624 1.654219 -0.127578
H  -4.198818 0.79657 -1.300365
H  -2.289179 0.63947 -2.851323
H  -2.260922 2.310363 -2.313799
H  -2.566714 -1.714444 1.344878
H  0.600237 -1.360209 -1.378397
H  -0.882156 -1.455164 -2.325551
H  -0.958733 2.278864 0.467578
H  -0.565992 3.100207 -1.020543
H  -0.366118 -1.106015 1.137657
H  -4.00156 0.93555 1.83046
H  -3.507584 -0.260255 3.013286
H  -2.289687 0.68842 2.170406
H  -4.584986 -2.327485 0.074725
H  -5.295448 -0.744817 0.389837
H  -5.003577 -1.859691 1.718226
H  -1.877005 -3.759175 -2.269872
H  0.850062 1.881456 2.008206
H  1.732748 2.521035 -2.128257
H  3.246057 1.913629 2.526999
H  4.128813 2.53822 -1.622512
H  -0.67879 -4.862495 1.545252
elementType: Cl O N C H
totalener: -1400.16673700 hartree
nucrepener: 2137.43410231 hartree
electener: -3537.60083930 hartree
oneelecener: -6159.32168515 hartree
twoeener: 2621.72084585 hartree
cpcmener: -0.02397912 hartree
kineticenergy: 1395.23997675 hartree
xcener: -114.435293113166 hartree
chargesum: 0.0000000
charge: -0.109457 -0.392557 0.136910 -0.398446 -0.407154 0.238871 -0.000337 0.102046 -0.231366 -0.187440 0.022474 -0.173895 -0.122160 -0.327048 -0.306150 0.063119 0.060430 -0.213601 -0.245781 -0.151944 -0.152417 0.088397 0.089889 0.075398 0.073795 0.089800 0.084556 0.088987 0.076348 0.032399 0.128027 0.116769 0.102533 0.102658 0.207215 0.082141 0.100061 0.097144 0.087804 0.085751 0.092983 0.178769 0.131261 0.138877 0.140411 0.141182 0.162749
qa: -0.1095 -0.3926 0.1369 -0.3984 -0.4072 0.2389 -0.0003 0.1020 -0.2314 -0.1874 0.0225 -0.1739 -0.1222 -0.3270 -0.3062 0.0631 0.0604 -0.2136 -0.2458 -0.1519 -0.1524 0.0884 0.0899 0.0754 0.0738 0.0898 0.0846 0.0890 0.0763 0.0324 0.1280 0.1168 0.1025 0.1027 0.2072 0.0821 0.1001 0.0971 0.0878 0.0858 0.0930 0.1788 0.1313 0.1389 0.1404 0.1412 0.1627
va: 1.1962 1.9968 3.3207 2.8355 3.0213 3.9592 3.7368 3.7133 3.9747 3.9764 3.7909 3.9835 3.7799 3.9322 3.9342 3.5146 4.0383 4.0049 4.0007 3.9906 3.9799 4.0070 3.8179 1.0080 1.0113 0.9961 1.0147 1.0075 1.0180 1.0341 0.9997 0.9978 1.0041 1.0070 1.0666 0.9965 1.0051 1.0203 1.0037 1.0006 1.0043 0.9910 1.0149 1.0050 1.0066 1.0064 0.9940
dispcorr: -0.027471794 hartree
energy: -1400.194208790750
dipole: -42.40856 40.91660 -1.49196 -1.81716 2.23108 0.41391 -3.28360 1.66487 -1.61873
magnitude: 2.23999 au
magnitude: 5.69360 debye
