program: Orca
programVersion: 4.2.1
elementType: Cl O N N N C C C C C C C C C C C C C C C C C C H H H H H H H H H H H H H H H H H H H H H H H H
charge: 0
multiplicity: 1
keywords: wb97x-d3
keywords: def2-TZVPP
keywords: def2/J RIJCOSX GRIDX6 NOFINALGRIDX
keywords: grid4 nofinalgrid
keywords: scfconv7
keywords: smallprint printgap noloewdin
keywords: NOSOSCF
formula: C18H24ClN3O
InChI: InChI=1S/C18H24ClN3O/c1-13(2)17-8-5-15(9-14-3-6-16(19)7-4-14)18(17,23)10-22-12-20-11-21-22/h3-4,6-7,11-13,15,17,23H,5,8-10H2,1-2H3
47 atoms
Cl 5.506597 1.001791 0.062459
O  -1.073656 0.369595 1.175039
N  -0.345339 -2.111361 -0.271434
N  -0.119046 -2.3143 1.029014
N  -0.517376 -4.257017 0.002144
C  -1.335714 0.192748 -0.196843
C  -2.817744 -0.189995 -0.445107
C  -1.184548 1.566763 -0.922333
C  -3.527839 1.159474 -0.36349
C  -2.619071 2.092056 -1.151762
C  -3.452404 -1.309659 0.405836
C  -0.326322 -0.776906 -0.830674
C  -0.301908 2.591799 -0.199927
C  -3.962584 -0.860551 1.773641
C  -4.593344 -1.961508 -0.372458
C  1.149671 2.208462 -0.107001
C  -0.582085 -3.276924 -0.870888
C  1.964286 2.291798 -1.235275
C  1.721581 1.75118 1.076967
C  3.30063 1.924657 -1.196296
C  3.057333 1.381995 1.138693
C  -0.235913 -3.615136 1.148714
C  3.836671 1.466427 -0.003268
H  -2.870509 -0.513099 -1.494778
H  -0.725146 1.382932 -1.898858
H  -3.592263 1.491261 0.675426
H  -4.546567 1.130175 -0.754591
H  -2.866415 2.049412 -2.214664
H  -2.727992 3.134636 -0.846301
H  -2.71002 -2.091079 0.584797
H  0.685614 -0.382231 -0.723003
H  -0.527094 -0.877705 -1.89611
H  -0.703016 2.807575 0.791373
H  -0.374265 3.524409 -0.766994
H  -0.819827 -0.480665 1.562849
H  -4.301036 -1.725643 2.347837
H  -3.199764 -0.35543 2.363698
H  -4.815748 -0.18454 1.686117
H  -5.059513 -2.761734 0.206086
H  -4.24307 -2.397933 -1.310152
H  -5.375853 -1.238731 -0.616517
H  -0.789801 -3.363489 -1.925903
H  1.552764 2.656065 -2.169867
H  1.118147 1.67842 1.971419
H  3.913983 2.000847 -2.084294
H  3.481098 1.029595 2.069727
H  -0.108952 -4.114028 2.09683
elementType: Cl O N C H
totalener: -1400.16802422 hartree
nucrepener: 2165.59606376 hartree
electener: -3565.76408798 hartree
oneelecener: -6215.52887232 hartree
twoeener: 2649.76478434 hartree
cpcmener: -0.02264528 hartree
kineticenergy: 1395.24426271 hartree
xcener: -114.437934251946 hartree
chargesum: -0.0000000
charge: -0.107282 -0.438184 0.123082 -0.383500 -0.403287 0.411125 -0.023475 -0.078438 -0.232066 -0.132821 0.006029 -0.189571 -0.096181 -0.312660 -0.301280 0.027901 0.062162 -0.219715 -0.208464 -0.149511 -0.146488 0.085456 0.089124 0.075048 0.082471 0.086898 0.082517 0.085378 0.071202 0.020903 0.151483 0.111948 0.097225 0.102043 0.218510 0.098866 0.091154 0.086086 0.093587 0.086513 0.089049 0.175046 0.136271 0.129958 0.142447 0.141734 0.161711
qa: -0.1073 -0.4382 0.1231 -0.3835 -0.4033 0.4111 -0.0235 -0.0784 -0.2321 -0.1328 0.0060 -0.1896 -0.0962 -0.3127 -0.3013 0.0279 0.0622 -0.2197 -0.2085 -0.1495 -0.1465 0.0855 0.0891 0.0750 0.0825 0.0869 0.0825 0.0854 0.0712 0.0209 0.1515 0.1119 0.0972 0.1020 0.2185 0.0989 0.0912 0.0861 0.0936 0.0865 0.0890 0.1750 0.1363 0.1300 0.1424 0.1417 0.1617
va: 1.1982 2.0131 3.3568 2.8441 3.0279 3.8212 3.7406 3.8896 4.0306 3.9383 3.8607 3.8996 3.8082 3.9209 3.9354 3.5400 4.0457 3.9671 3.9797 3.9767 3.9850 4.0105 3.8231 1.0125 1.0112 1.0053 1.0134 1.0049 1.0157 1.0181 0.9925 1.0099 1.0161 1.0053 1.0588 1.0052 1.0261 0.9942 1.0043 1.0039 1.0018 0.9931 1.0061 1.0243 1.0049 1.0053 0.9950
dispcorr: -0.028222438 hartree
energy: -1400.196246660662
dipole: -44.90903 43.70920 -1.19983 0.74035 -0.04387 0.69648 -2.32962 0.80663 -1.52299
magnitude: 2.06014 au
magnitude: 5.23646 debye
