program: Orca
programVersion: 4.2.1
elementType: Cl O N N N C C C C C C C C C C C C C C C C C C H H H H H H H H H H H H H H H H H H H H H H H H
charge: 0
multiplicity: 1
keywords: wb97x-d3
keywords: def2-TZVPP
keywords: def2/J RIJCOSX GRIDX6 NOFINALGRIDX
keywords: grid4 nofinalgrid
keywords: scfconv7
keywords: smallprint printgap noloewdin
keywords: NOSOSCF
formula: C18H24ClN3O
InChI: InChI=1S/C18H24ClN3O/c1-13(2)17-8-5-15(9-14-3-6-16(19)7-4-14)18(17,23)10-22-12-20-11-21-22/h3-4,6-7,11-13,15,17,23H,5,8-10H2,1-2H3
47 atoms
Cl 5.093022 3.274409 -0.518334
O  -2.070165 -1.4572 1.371521
N  -0.644644 -2.783918 -0.870541
N  -0.289499 -3.408989 0.256736
N  1.339836 -3.572641 -1.261712
C  -1.990574 -0.923642 0.073303
C  -3.272397 -0.093245 -0.262062
C  -0.787129 0.070294 -0.103203
C  -2.704645 1.071878 -1.077975
C  -1.427647 1.436249 -0.340948
C  -4.091489 0.322098 0.982984
C  -1.896681 -2.064589 -0.953767
C  0.245663 0.045726 1.025752
C  -4.933617 1.574402 0.750708
C  -5.020794 -0.814302 1.409152
C  1.462442 0.853209 0.669914
C  0.338347 -2.886374 -1.765154
C  1.616321 2.169184 1.095997
C  2.460948 0.304686 -0.132922
C  2.725779 2.921316 0.735737
C  3.576844 1.038057 -0.504318
C  0.907822 -3.866196 -0.022693
C  3.69908 2.347085 -0.065055
H  -3.944817 -0.689409 -0.891952
H  -0.262107 -0.192886 -1.02985
H  -3.398832 1.900814 -1.205109
H  -2.455032 0.728322 -2.087257
H  -0.781537 2.114324 -0.900128
H  -1.663574 1.925604 0.610197
H  -3.412831 0.540743 1.812576
H  -1.97395 -1.674197 -1.967514
H  -2.714914 -2.772134 -0.806346
H  0.560737 -0.979249 1.235734
H  -0.20019 0.429883 1.945534
H  -1.43499 -2.183847 1.452734
H  -5.578744 1.756872 1.612835
H  -4.330086 2.472276 0.614494
H  -5.583286 1.472267 -0.122383
H  -5.521253 -0.581467 2.351644
H  -4.494967 -1.757761 1.541559
H  -5.800544 -0.972587 0.658851
H  0.281731 -2.45694 -2.753204
H  0.861734 2.623605 1.726579
H  2.37814 -0.721345 -0.473937
H  2.826962 3.941793 1.080456
H  4.342028 0.589497 -1.123731
H  1.484163 -4.431931 0.692694
elementType: Cl O N C H
totalener: -1400.16821505 hartree
nucrepener: 2128.64688421 hartree
electener: -3528.81509926 hartree
oneelecener: -6141.35402987 hartree
twoeener: 2612.53893060 hartree
cpcmener: -0.02370679 hartree
kineticenergy: 1395.22354961 hartree
xcener: -114.432842170865 hartree
chargesum: 0.0000000
charge: -0.106078 -0.413729 0.142736 -0.394426 -0.408427 0.278353 0.008836 0.007130 -0.190694 -0.226004 0.057340 -0.170686 -0.148951 -0.321141 -0.322020 0.076137 0.051369 -0.223592 -0.226250 -0.147670 -0.166447 0.088915 0.093584 0.078068 0.088791 0.088363 0.087581 0.086886 0.082041 0.042943 0.119067 0.133117 0.103848 0.101217 0.212188 0.092382 0.087450 0.091266 0.091074 0.092346 0.080150 0.180679 0.138232 0.137549 0.142012 0.141205 0.163261
qa: -0.1061 -0.4137 0.1427 -0.3944 -0.4084 0.2784 0.0088 0.0071 -0.1907 -0.2260 0.0573 -0.1707 -0.1490 -0.3211 -0.3220 0.0761 0.0514 -0.2236 -0.2263 -0.1477 -0.1664 0.0889 0.0936 0.0781 0.0888 0.0884 0.0876 0.0869 0.0820 0.0429 0.1191 0.1331 0.1038 0.1012 0.2122 0.0924 0.0874 0.0913 0.0911 0.0923 0.0802 0.1807 0.1382 0.1375 0.1420 0.1412 0.1633
va: 1.1988 1.9898 3.2983 2.8375 2.9955 3.9085 3.7883 3.7249 3.9714 3.9921 3.7451 3.9618 3.7755 3.9470 3.9160 3.4786 4.0267 3.9868 3.9781 3.9852 4.0389 3.9984 3.8156 1.0010 1.0190 1.0092 1.0107 1.0137 1.0037 1.0266 0.9989 0.9985 1.0286 1.0222 1.0631 1.0057 0.9992 0.9991 1.0048 1.0304 1.0027 0.9902 1.0057 1.0159 1.0055 1.0071 0.9945
dispcorr: -0.027419905 hartree
energy: -1400.195634958564
dipole: -45.33369 43.73726 -1.59643 -3.40331 3.44467 0.04136 4.46591 -5.41963 -0.95372
magnitude: 1.86008 au
magnitude: 4.72794 debye
