program: Gaussian 09
title: 000030448
version: EM64L-G09RevD.01
frameworkgroup: C1[X(C9H10N2O3)]
method: RPBEPBE
basis: SDD
operation: Freq
keyword: #p
keyword: freq=noraman
keyword: PBEPBE/SDD
title: #p freq=noraman PBEPBE/SDD
converged: NO YES NO NO
title: Mulliken charges:
elementType: O O O N N C C C C C C C C C H H H H H H H H H H
charge: -0.241076 -0.208741 -0.209629 -0.037083 0.020919 0.311538 0.255506 -0.462315 -0.406183 -0.349939 -0.518473 0.401155 -0.384739 -0.608716 0.234647 0.226251 0.235190 0.232877 0.244607 0.290094 0.288051 0.221340 0.252803 0.211916
chargesum: 0.00000
title: Mulliken charges with hydrogens summed into heavy atoms:
elementType: O O O N N C C C C C C C C C
charge: -0.241076 -0.208741 -0.209629 -0.037083 0.020919 0.311538 0.255506 -0.001418 0.061884 -0.105332 -0.228379 0.401155 -0.096688 0.077343
polarizability: 1.88097774e+02 5.23273077e+00 1.30897830e+02 1.39156182e-01 1.38803129e+00 6.22127733e+01
1716.lowfreq: -4.6900 -0.0008 -0.0002 0.0003 5.6462 9.3498 58.3218 59.6946 131.7754
frequency: 58.3051 59.6547 131.7754 151.5455 169.3033 214.7739 240.7043 277.8251 305.2506 308.8868 364.9483 420.9332 431.6307 462.3128 475.9611 517.6371 522.4420 612.7999 668.9573 682.3603 714.2017 718.2596 750.4121 777.2466 841.8853 895.9242 919.5678 925.8766 971.4786 986.8839 992.0878 1017.4450 1062.4262 1082.0675 1119.1860 1135.4766 1183.8512 1187.2646 1208.7575 1218.1650 1229.1508 1235.1902 1258.0976 1320.7584 1337.2961 1366.0104 1406.6285 1413.3745 1426.3920 1430.5097 1433.1976 1448.5613 1479.4396 1484.1000 1595.2703 1617.1725 2893.8770 2937.7814 2976.6624 3024.5001 3059.9089 3062.5406 3117.9364 3134.7736 3161.5584 3187.5974
redmass: 6.7271 5.8932 3.1295 5.2591 4.9654 1.2189 2.2444 3.8441 3.8288 4.1258 4.7799 2.9849 3.1655 3.8353 5.0368 4.6682 6.3762 5.9945 6.5380 5.3027 3.5531 5.7841 5.1055 5.2014 1.3972 4.0170 1.9797 2.4806 1.6852 3.0203 1.8299 2.2397 2.3312 1.9745 1.5122 1.5182 2.1689 2.2389 2.8515 2.2131 1.4556 1.7248 1.3566 1.3348 1.8318 8.5647 3.4072 1.3907 2.1795 1.1640 1.3146 1.0569 1.0589 2.6670 7.8987 7.2760 1.0678 1.0458 1.0622 1.0894 1.0866 1.0992 1.1001 1.0907 1.0921 1.0948
irintensity: 0.9427 0.1094 0.1957 1.9590 4.3228 2.6267 6.4447 3.3548 4.0925 9.0736 4.5711 5.1943 4.0651 0.2433 0.5353 0.2865 0.1682 2.0013 19.5536 8.9727 15.4798 12.7269 8.9770 5.1541 29.3966 2.0384 17.6049 3.4988 7.8591 25.4898 9.0959 10.9751 32.7965 15.7758 3.5802 14.6332 0.8598 9.7448 167.9763 137.0197 3.8516 45.0594 9.1442 1.5671 5.5284 100.0025 1.2037 9.2227 42.8039 18.2730 1.1142 13.1800 12.8563 15.6348 23.9385 13.1850 40.4718 84.3140 33.5553 10.3828 25.7840 12.9932 15.5457 10.3499 1.3953 2.1462
temp: 298.150 k
press: 1.00000 atm
elementType: 8 8 8 7 7 6 6 6 6 6 6 6 6 6 1 1 1 1 1 1 1 1 1 1
symmnumber: 1
zpe: 477458.1 jmol-1
zpe.correction: 0.181854 hartree
zpe.thermalcorrener: 0.193845 hartree
zpe.thermalcorrenthalpy: 0.194789 hartree
zpe.thermalcorrgfe: 0.143529 hartree
zpe.sumelectzpe: -682.960121 hartree
zpe.sumelectthermal: -682.948131 hartree
zpe.sumelectthermalent: -682.947187 hartree
zpe.sumelectthermalfe: -682.998447 hartree
dipole: 5.4777 2.2304 0.0323
dipole: 5.9144
quadrupole: -98.8080 -74.0116 -83.4414
quadrupole: 2.5254 -1.2068 0.7681
quadrupole: -13.3876 11.4087 1.9789 2.5254 -1.2068 0.7681
hfenergy: -683.1419756 hartree
pointgroup: C01 [X(C9H10N2O3)]
dipole: 2.1506607 0.8878493 0.0306888 debye
dipolederiv: -0.6608863 -0.0195984 0.0102348 -0.0831352 -0.4995262 -0.0515288 0.0680123 0.1650999 -0.2853833 -0.8927098 0.1786634 -0.0040171 0.2137536 -0.5678141 -0.0111395 -0.0079501 -0.0111609 -0.2307921 -0.6655998 -0.180216 -0.0163431 -0.2597789 -0.7569697 -0.0308093 -0.0217133 -0.0271004 -0.2313696 -0.2143738 0.0121628 -0.1244771 0.0428203 0.033086 -0.1180393 -0.0712445 -0.1676402 -0.2323235 1.8983832 0.1327585 0.0390935 0.2089725 1.1092124 0.0473519 0.053381 0.0404037 0.1897927 0.4231029 0.0904855 0.0349098 0.2616498 0.0252794 0.0021277 0.1408933 -0.028966 -0.0262865 -0.1529068 -0.2655798 -0.0348918 -0.4140325 -0.0374365 -0.0072634 -0.1173564 -0.0146623 -0.0585201 0.0123172 -0.0926106 -0.0216102 -0.1883886 0.1858314 0.0712609 -0.0924569 0.0240648 0.3040621 0.5251888 0.1285227 0.0313935 0.0346816 0.2850809 0.0376291 0.1374698 0.0509512 0.32194 -0.3517044 0.0571502 -0.0031828 0.1308608 0.1567523 0.0244537 0.0118822 0.0277558 -0.1384655 0.1677131 0.2047157 0.0193114 -0.0993821 -0.0533589 0.004088 -0.001121 0.0232657 -0.1113322 -0.7345231 -0.1621586 -0.0276784 -0.1872892 0.018768 -0.0041507 -0.0076847 -0.0082195 0.0608742 0.1191413 -0.0358566 0.0068122 0.2667864 -0.0349583 0.0035592 0.0084637 0.0032848 -0.1133773 0.3609815 0.0194184 0.070431 0.0446601 0.083326 0.0286592 0.0641277 0.0533223 0.2762471 0.0209343 0.0031888 0.0188071 -0.0022306 -0.0614952 0.0741909 0.068733 0.0840546 0.0344089 -0.0828016 -0.0264163 -0.0669922 0.0497315 0.0297424 -0.0479056 -0.0201492 -0.13145 -0.133551 -0.0086296 -0.0669608 0.0231355 -0.024119 -0.0186935 0.0668625 -0.0081933 0.1003749 0.0399582 -0.0375905 0.0354924 0.0156505 0.0314519 0.0361263 -0.053382 -0.0210645 -0.1363717 -0.0865539 0.055654 -0.0752071 -0.0034654 -0.0519447 -0.0680513 -0.0115017 0.0033145 -0.005204 0.1435282 0.1312187 -0.023483 -0.0039946 -0.0094469 0.0298214 -0.0060927 -0.0112031 0.0014445 0.1605537 0.0748257 0.066849 0.002246 0.0291602 0.0846107 -0.002657 -0.0037521 -0.0039792 0.1724698 0.0540974 -0.0274597 0.009614 -0.1019904 -0.0383929 0.1088473 0.0088308 0.0970686 0.0362928 -0.0031975 0.0538458 0.0259432 0.1506278 -0.0182163 -0.0633719 0.0052816 -0.0636217 0.082412 -0.0386347 -0.0077064 -0.00093 -0.0434184 0.0772759 -0.0611886 -0.1865008 -0.0727147 -0.174585 unknown
polarizability: 188.0416328|5.5022976|130.913353|0.6936127|2.1376937|62.2533917 unknown
InChI: InChI=1S/C9H10N2O3/c1-10-5-7-2-3-9(11(12)13)4-8(7)6-14-10/h2-4H,5-6H2,1H3
charge 0 multiplicity 1
24 atoms
O  2.783998 -1.172098 0.499449
O  -4.196755 0.689482 -0.023016
O  -3.637998 -1.52005 -0.115498
N  3.136757 0.013383 -0.401528
N  -3.328293 -0.266799 -0.052618
C  0.830225 0.767879 0.069504
C  0.440152 -0.598548 0.005359
C  2.305504 1.135974 0.117987
C  1.509518 -1.6818 -0.015535
C  -0.161552 1.779381 0.103969
C  -0.928547 -0.933749 -0.039737
C  -1.890974 0.09559 -0.00886
C  -1.530387 1.45859 0.065803
C  4.582933 0.219124 -0.16956
H  2.497901 2.014196 -0.527575
H  2.589216 1.409338 1.162682
H  1.249853 -2.516769 0.65928
H  1.6489 -2.071224 -1.043879
H  0.144745 2.830688 0.154828
H  -1.266565 -1.973399 -0.091952
H  -2.310891 2.222721 0.088273
H  4.905695 1.079119 -0.782798
H  5.123166 -0.679821 -0.502743
H  4.827698 0.416092 0.897164
