program: Orca
programVersion: 4.2.1
elementType: Cl O N N N C C C C C C C C C C C C C C C C C C H H H H H H H H H H H H H H H H H H H H H H H H
charge: 0
multiplicity: 1
keywords: wb97x-d3
keywords: def2-TZVPP
keywords: def2/J RIJCOSX GRIDX6 NOFINALGRIDX
keywords: grid4 nofinalgrid
keywords: scfconv7
keywords: smallprint printgap noloewdin
keywords: NOSOSCF
formula: C18H24ClN3O
InChI: InChI=1S/C18H24ClN3O/c1-13(2)17-8-5-15(9-14-3-6-16(19)7-4-14)18(17,23)10-22-12-20-11-21-22/h3-4,6-7,11-13,15,17,23H,5,8-10H2,1-2H3
47 atoms
Cl 5.550807 1.09485 -0.175779
O  -1.127553 0.177861 1.295071
N  -0.241175 -2.147765 -0.000588
N  -0.837468 -3.161798 -0.632065
N  -0.090359 -3.824819 1.369636
C  -1.303641 0.093782 -0.101475
C  -2.706741 -0.464657 -0.537247
C  -1.203023 1.483194 -0.788323
C  -3.378279 0.673724 -1.331183
C  -2.65408 1.94028 -0.902933
C  -3.574732 -1.051835 0.59388
C  -0.173605 -0.822555 -0.576101
C  -0.302134 2.520593 -0.114777
C  -4.335267 -0.026924 1.437421
C  -4.574082 -2.044002 0.004815
C  1.161709 2.179822 -0.112216
C  0.195977 -2.556403 1.191861
C  1.802813 1.723203 1.036152
C  1.912919 2.295324 -1.280208
C  3.149043 1.387434 1.026493
C  3.258707 1.964256 -1.311252
C  -0.723377 -4.144826 0.22469
C  3.866881 1.509078 -0.151866
H  -2.52441 -1.296326 -1.2216
H  -0.834681 1.321488 -1.80955
H  -4.457808 0.72481 -1.181492
H  -3.22636 0.520543 -2.402447
H  -2.775386 2.766095 -1.606077
H  -3.020144 2.29479 0.067451
H  -2.917679 -1.614352 1.26343
H  0.796243 -0.398576 -0.31696
H  -0.203837 -0.933385 -1.658371
H  -0.641172 2.706862 0.906143
H  -0.441873 3.463518 -0.651244
H  -1.818953 0.720988 1.684202
H  -3.718517 0.770596 1.856264
H  -5.128297 0.459964 0.86651
H  -4.81387 -0.520486 2.285108
H  -5.202047 -2.48461 0.781914
H  -4.064437 -2.861254 -0.508581
H  -5.240056 -1.562954 -0.715971
H  0.715629 -1.912296 1.883082
H  1.243866 1.617583 1.956898
H  1.444619 2.655948 -2.18887
H  3.628227 1.034405 1.929938
H  3.824746 2.065771 -2.227657
H  -1.103757 -5.132113 0.012099
elementType: Cl O N C H
totalener: -1400.16602232 hartree
nucrepener: 2161.11768032 hartree
electener: -3561.28370264 hartree
oneelecener: -6206.25408205 hartree
twoeener: 2644.97037941 hartree
cpcmener: -0.02464463 hartree
kineticenergy: 1395.24356275 hartree
xcener: -114.434719963872 hartree
chargesum: 0.0000000
charge: -0.104715 -0.407452 0.131690 -0.357012 -0.410826 0.332636 -0.070139 0.022036 -0.162102 -0.234805 0.013727 -0.194476 -0.115666 -0.289379 -0.306607 0.054934 0.062628 -0.235020 -0.221916 -0.130510 -0.139415 0.057576 0.084683 0.078680 0.079408 0.083846 0.091597 0.090026 0.082598 0.044814 0.140968 0.125609 0.087233 0.104152 0.212251 0.069539 0.086909 0.104615 0.092830 0.085450 0.085601 0.160946 0.127394 0.138084 0.143274 0.143059 0.161248
qa: -0.1047 -0.4075 0.1317 -0.3570 -0.4108 0.3326 -0.0701 0.0220 -0.1621 -0.2348 0.0137 -0.1945 -0.1157 -0.2894 -0.3066 0.0549 0.0626 -0.2350 -0.2219 -0.1305 -0.1394 0.0576 0.0847 0.0787 0.0794 0.0838 0.0916 0.0900 0.0826 0.0448 0.1410 0.1256 0.0872 0.1042 0.2123 0.0695 0.0869 0.1046 0.0928 0.0854 0.0856 0.1609 0.1274 0.1381 0.1433 0.1431 0.1612
va: 1.2007 2.0201 3.3426 2.8723 3.0374 3.8482 3.7955 3.8018 3.9154 3.9779 3.8505 3.8627 3.8365 3.9265 3.9338 3.4960 4.0757 3.9616 3.9850 3.9662 3.9700 4.0354 3.8336 1.0255 1.0135 1.0137 1.0052 1.0203 1.0028 1.0256 1.0050 1.0176 1.0188 1.0075 1.0368 1.0170 1.0013 1.0047 1.0038 1.0102 1.0020 1.0056 1.0286 1.0054 1.0045 1.0046 0.9958
dispcorr: -0.028603232 hartree
energy: -1400.194625547689
dipole: -45.86355 44.38729 -1.47626 2.73516 -0.47132 2.26384 -0.89619 0.31628 -0.57991
magnitude: 2.76417 au
magnitude: 7.02595 debye
