program: Orca
programVersion: 4.2.1
elementType: Cl O N N N C C C C C C C C C C C C C C C C C C H H H H H H H H H H H H H H H H H H H H H H H H
charge: 0
multiplicity: 1
keywords: wb97x-d3
keywords: def2-TZVPP
keywords: def2/J RIJCOSX GRIDX6 NOFINALGRIDX
keywords: grid4 nofinalgrid
keywords: scfconv7
keywords: smallprint printgap noloewdin
keywords: NOSOSCF
formula: C18H24ClN3O
InChI: InChI=1S/C18H24ClN3O/c1-13(2)17-8-5-15(9-14-3-6-16(19)7-4-14)18(17,23)10-22-12-20-11-21-22/h3-4,6-7,11-13,15,17,23H,5,8-10H2,1-2H3
47 atoms
Cl 5.093744 3.595807 -0.915015
O  -1.993534 -0.944046 1.60962
N  -0.812405 -2.859392 -0.329966
N  -0.600016 -3.323178 0.90421
N  0.964683 -4.094471 -0.489539
C  -1.89827 -0.674228 0.230371
C  -3.107127 0.20978 -0.191239
C  -0.669132 0.225429 -0.067383
C  -2.607451 1.672301 -0.091354
C  -1.151404 1.607088 0.360455
C  -4.427864 -0.001963 0.568484
C  -1.912398 -1.961997 -0.609847
C  0.647629 -0.173098 0.608511
C  -5.522092 0.858806 -0.063428
C  -4.919747 -1.445344 0.621271
C  1.767837 0.762567 0.247802
C  0.128098 -3.32634 -1.150522
C  2.44565 0.615959 -0.960373
C  2.145945 1.805859 1.087902
C  3.466316 1.478985 -1.327535
C  3.163626 2.682094 0.73927
C  0.477128 -4.058103 0.762628
C  3.81642 2.510621 -0.470332
H  -3.306244 -0.01095 -1.247541
H  -0.519627 0.230901 -1.155347
H  -3.206688 2.257842 0.608137
H  -2.689076 2.16971 -1.059177
H  -0.545961 2.412863 -0.055796
H  -1.08627 1.691145 1.449294
H  -4.281151 0.342173 1.598127
H  -1.853321 -1.709957 -1.667533
H  -2.840314 -2.512352 -0.458365
H  0.950643 -1.182016 0.326498
H  0.512146 -0.177404 1.692226
H  -1.44904 -1.716862 1.820473
H  -5.740704 0.527856 -1.082362
H  -6.450333 0.788064 0.507203
H  -5.256866 1.915658 -0.113066
H  -5.062429 -1.859792 -0.380351
H  -5.888349 -1.493255 1.124005
H  -4.246311 -2.100304 1.171107
H  0.161669 -3.086406 -2.201882
H  2.181267 -0.193574 -1.631176
H  1.642888 1.941866 2.037654
H  3.983912 1.343791 -2.267766
H  3.442548 3.485836 1.407481
H  0.923807 -4.582793 1.59266
elementType: Cl O N C H
totalener: -1400.17118289 hartree
nucrepener: 2112.02338823 hartree
electener: -3512.19457112 hartree
oneelecener: -6108.13556820 hartree
twoeener: 2595.94099708 hartree
cpcmener: -0.02504635 hartree
kineticenergy: 1395.23779013 hartree
xcener: -114.437118397438 hartree
chargesum: -0.0000000
charge: -0.105472 -0.449474 0.123642 -0.377569 -0.401821 0.415850 -0.110294 0.042638 -0.183296 -0.234733 0.087873 -0.206011 -0.134957 -0.305788 -0.347578 0.040660 0.053829 -0.217504 -0.218414 -0.165162 -0.150434 0.083251 0.097327 0.081166 0.085064 0.074089 0.091883 0.084628 0.080503 0.034163 0.108835 0.172397 0.091662 0.101877 0.222609 0.082358 0.091338 0.092347 0.082953 0.096716 0.091006 0.176424 0.138552 0.137436 0.141451 0.142117 0.161862
qa: -0.1055 -0.4495 0.1236 -0.3776 -0.4018 0.4158 -0.1103 0.0426 -0.1833 -0.2347 0.0879 -0.2060 -0.1350 -0.3058 -0.3476 0.0407 0.0538 -0.2175 -0.2184 -0.1652 -0.1504 0.0833 0.0973 0.0812 0.0851 0.0741 0.0919 0.0846 0.0805 0.0342 0.1088 0.1724 0.0917 0.1019 0.2226 0.0824 0.0913 0.0923 0.0830 0.0967 0.0910 0.1764 0.1386 0.1374 0.1415 0.1421 0.1619
va: 1.2000 2.0174 3.3394 2.8434 3.0203 3.7966 3.8262 3.7386 3.9812 4.0119 3.8188 3.9214 3.7996 3.9385 3.9425 3.5297 4.0417 3.9891 3.9802 4.0200 3.9922 4.0128 3.8181 1.0103 1.0205 1.0095 1.0022 1.0121 1.0171 1.0241 1.0093 0.9759 1.0169 1.0300 1.0580 1.0014 1.0056 1.0065 0.9989 1.0076 1.0211 0.9928 1.0044 1.0073 1.0067 1.0055 0.9952
dispcorr: -0.026826913 hartree
energy: -1400.198009806172
dipole: -45.20354 43.75655 -1.44699 -6.34572 6.22645 -0.11927 3.13800 -4.19569 -1.05769
magnitude: 1.79631 au
magnitude: 4.56584 debye
