program: Orca
programVersion: 4.2.1
elementType: Cl O N N N C C C C C C C C C C C C C C C C C C H H H H H H H H H H H H H H H H H H H H H H H H
charge: 0
multiplicity: 1
keywords: wb97x-d3
keywords: def2-TZVPP
keywords: def2/J RIJCOSX GRIDX6 NOFINALGRIDX
keywords: grid4 nofinalgrid
keywords: scfconv7
keywords: smallprint printgap noloewdin
keywords: NOSOSCF
formula: C18H24ClN3O
InChI: InChI=1S/C18H24ClN3O/c1-13(2)17-8-5-15(9-14-3-6-16(19)7-4-14)18(17,23)10-22-12-20-11-21-22/h3-4,6-7,11-13,15,17,23H,5,8-10H2,1-2H3
47 atoms
Cl 5.309075 3.397758 -0.428005
O  -1.868746 -1.302402 1.364258
N  -0.876012 -2.884715 -0.814107
N  0.319628 -2.743649 -1.39385
N  0.278698 -4.597159 -0.141903
C  -1.852696 -0.767233 0.062015
C  -3.09445 0.162503 -0.098124
C  -0.601631 0.139956 -0.227441
C  -2.520754 1.575589 0.005205
C  -1.192733 1.463817 -0.720383
C  -4.289053 -0.102481 0.829019
C  -1.930808 -1.90711 -0.970244
C  0.317295 0.333716 0.988249
C  -5.358948 0.97025 0.626963
C  -4.921173 -1.476982 0.62414
C  1.558801 1.10786 0.639849
C  -0.884018 -3.994003 -0.0690
C  1.762515 2.403481 1.10337
C  2.543047 0.537815 -0.166471
C  2.909744 3.116134 0.780999
C  3.694671 1.231769 -0.500325
C  0.977292 -3.790262 -0.962391
C  3.868678 2.52142 -0.02068
H  -3.453812 0.040959 -1.13021
H  0.004741 -0.312525 -1.014584
H  -2.370292 1.851738 1.054638
H  -3.173058 2.329746 -0.435671
H  -1.370795 1.415469 -1.798111
H  -0.529737 2.314021 -0.552007
H  -3.94462 -0.034405 1.865276
H  -1.872823 -1.509553 -1.982926
H  -2.87825 -2.437199 -0.881323
H  0.639754 -0.635796 1.38009
H  -0.213246 0.835937 1.800422
H  -1.036211 -1.745144 1.553798
H  -6.231753 0.766637 1.250662
H  -5.005911 1.967939 0.889213
H  -5.70025 1.001171 -0.411386
H  -5.274886 -1.601787 -0.402642
H  -5.786609 -1.600747 1.278708
H  -4.237811 -2.29501 0.847758
H  -1.748196 -4.32406 0.486485
H  1.018146 2.873475 1.7347
H  2.415844 -0.471421 -0.541752
H  3.04909 4.121401 1.155513
H  4.448404 0.76872 -1.122948
H  1.99664 -3.982217 -1.259114
elementType: Cl O N C H
totalener: -1400.16840012 hartree
nucrepener: 2104.69499524 hartree
electener: -3504.86339536 hartree
oneelecener: -6093.28701568 hartree
twoeener: 2588.42362032 hartree
cpcmener: -0.02446552 hartree
kineticenergy: 1395.23363790 hartree
xcener: -114.431481788082 hartree
chargesum: -0.0000000
charge: -0.105501 -0.390695 0.128120 -0.371329 -0.410945 0.267009 -0.032971 0.035295 -0.201429 -0.218054 0.081941 -0.207888 -0.097394 -0.310879 -0.340597 0.040283 0.045678 -0.235398 -0.223823 -0.142439 -0.165322 0.075252 0.094950 0.082397 0.084717 0.080727 0.082685 0.090126 0.091563 0.029939 0.126775 0.159733 0.097628 0.105657 0.208403 0.090732 0.092695 0.086987 0.088807 0.097303 0.088566 0.177663 0.139553 0.137040 0.142853 0.141135 0.162454
qa: -0.1055 -0.3907 0.1281 -0.3713 -0.4109 0.2670 -0.0330 0.0353 -0.2014 -0.2181 0.0819 -0.2079 -0.0974 -0.3109 -0.3406 0.0403 0.0457 -0.2354 -0.2238 -0.1424 -0.1653 0.0753 0.0950 0.0824 0.0847 0.0807 0.0827 0.0901 0.0916 0.0299 0.1268 0.1597 0.0976 0.1057 0.2084 0.0907 0.0927 0.0870 0.0888 0.0973 0.0886 0.1777 0.1396 0.1370 0.1429 0.1411 0.1625
va: 1.1995 2.0345 3.3138 2.8547 3.0359 3.9077 3.7951 3.7423 3.9697 4.0146 3.7763 3.9240 3.7441 3.9383 3.9367 3.5223 4.0679 3.9721 3.9984 3.9783 4.0251 4.0181 3.8192 1.0135 1.0386 1.0042 1.0131 1.0060 1.0117 1.0341 1.0134 0.9807 1.0198 1.0186 1.0335 1.0063 1.0016 0.9998 0.9986 1.0082 1.0155 0.9950 1.0062 1.0106 1.0052 1.0070 0.9951
dispcorr: -0.026683433 hartree
energy: -1400.195083549724
dipole: -46.15098 44.32246 -1.82852 -5.13583 5.41758 0.28175 4.07221 -4.11726 -0.04506
magnitude: 1.85065 au
magnitude: 4.70398 debye
