program: Orca
programVersion: 4.2.1
elementType: Cl O N N N C C C C C C C C C C C C C C C C C C H H H H H H H H H H H H H H H H H H H H H H H H
charge: 0
multiplicity: 1
keywords: wb97x-d3
keywords: def2-TZVPP
keywords: def2/J RIJCOSX GRIDX6 NOFINALGRIDX
keywords: grid4 nofinalgrid
keywords: scfconv7
keywords: smallprint printgap noloewdin
keywords: NOSOSCF
formula: C18H24ClN3O
InChI: InChI=1S/C18H24ClN3O/c1-13(2)17-8-5-15(9-14-3-6-16(19)7-4-14)18(17,23)10-22-12-20-11-21-22/h3-4,6-7,11-13,15,17,23H,5,8-10H2,1-2H3
47 atoms
Cl 5.449005 2.933129 -1.273817
O  -2.353978 0.423002 1.89287
N  -0.990731 -2.71979 0.675639
N  0.329848 -2.786057 0.489862
N  -0.699114 -4.402674 -0.66544
C  -1.808383 -0.358987 0.847686
C  -2.701481 -0.403188 -0.40644
C  -0.532369 0.294484 0.284181
C  -2.478562 0.976217 -1.052719
C  -1.077827 1.43408 -0.58919
C  -4.159074 -0.867517 -0.266138
C  -1.592436 -1.718002 1.522435
C  0.486863 0.729109 1.333805
C  -5.088984 0.063494 0.508696
C  -4.740906 -1.140004 -1.652293
C  1.731316 1.287708 0.704183
C  -1.58957 -3.69152 -0.017239
C  2.67072 0.436847 0.124098
C  1.968568 2.657707 0.654853
C  3.813022 0.931196 -0.485388
C  3.105637 3.173392 0.048345
C  0.458046 -3.805673 -0.32081
C  4.020615 2.302001 -0.517983
H  -2.219753 -1.131583 -1.07046
H  -0.049299 -0.43519 -0.372507
H  -3.240257 1.694672 -0.741483
H  -2.549377 0.916367 -2.13855
H  -0.414783 1.644467 -1.427701
H  -1.143818 2.362968 -0.015224
H  -4.149534 -1.826039 0.267447
H  -2.548068 -2.113273 1.869516
H  -0.959452 -1.605294 2.403198
H  0.759252 -0.128126 1.955674
H  0.045582 1.473698 1.999652
H  -2.610036 1.286595 1.551907
H  -5.135945 1.061167 0.067046
H  -6.106322 -0.333064 0.495385
H  -4.800569 0.171072 1.552218
H  -4.120498 -1.83593 -2.221407
H  -4.830739 -0.22331 -2.239857
H  -5.738966 -1.576285 -1.579789
H  -2.657567 -3.846714 -0.011331
H  2.509732 -0.635124 0.151378
H  1.257727 3.343246 1.100409
H  4.533176 0.254324 -0.925357
H  3.272422 4.24198 0.023332
H  1.423136 -4.136162 -0.672485
elementType: Cl O N C H
totalener: -1400.16905033 hartree
nucrepener: 2114.11940738 hartree
electener: -3514.28845771 hartree
oneelecener: -6112.16939126 hartree
twoeener: 2597.88093355 hartree
cpcmener: -0.02531662 hartree
kineticenergy: 1395.23999307 hartree
xcener: -114.435917373181 hartree
chargesum: 0.0000000
charge: -0.107124 -0.434353 0.133241 -0.376203 -0.412564 0.489464 -0.137802 -0.053610 -0.230845 -0.216144 0.041257 -0.215998 -0.089929 -0.325102 -0.297831 0.027282 0.058482 -0.211579 -0.213824 -0.170744 -0.154108 0.085044 0.099555 0.103348 0.090910 0.102401 0.087119 0.085438 0.087908 0.035981 0.138871 0.135064 0.099306 0.086665 0.221100 0.086791 0.092214 0.095077 0.090006 0.087498 0.095186 0.171021 0.144192 0.137362 0.140641 0.140719 0.158618
qa: -0.1071 -0.4344 0.1332 -0.3762 -0.4126 0.4895 -0.1378 -0.0536 -0.2308 -0.2161 0.0413 -0.2160 -0.0899 -0.3251 -0.2978 0.0273 0.0585 -0.2116 -0.2138 -0.1707 -0.1541 0.0850 0.0996 0.1033 0.0909 0.1024 0.0871 0.0854 0.0879 0.0360 0.1389 0.1351 0.0993 0.0867 0.2211 0.0868 0.0922 0.0951 0.0900 0.0875 0.0952 0.1710 0.1442 0.1374 0.1406 0.1407 0.1586
va: 1.1982 2.0271 3.2826 2.8181 3.0405 3.7465 3.8167 3.7685 3.9905 3.9935 3.8194 3.8620 3.7403 3.9186 3.9288 3.5306 4.0608 3.9677 3.9861 4.0286 3.9939 4.0083 3.8140 1.0058 1.0318 1.0013 1.0100 1.0096 1.0094 1.0206 0.9971 1.0070 1.0263 1.0340 1.0186 1.0017 1.0054 1.0251 1.0026 0.9993 1.0053 0.9948 1.0146 1.0073 1.0080 1.0062 0.9943
dispcorr: -0.027411095 hartree
energy: -1400.196461425474
dipole: -44.79747 42.73380 -2.06367 -5.16275 5.83161 0.66886 1.70951 -1.31330 0.39621
magnitude: 2.20524 au
magnitude: 5.60528 debye
