program: Orca
programVersion: 4.2.1
elementType: Cl O N N N C C C C C C C C C C C C C C C C C C H H H H H H H H H H H H H H H H H H H H H H H H
charge: 0
multiplicity: 1
keywords: wb97x-d3
keywords: def2-TZVPP
keywords: def2/J RIJCOSX GRIDX6 NOFINALGRIDX
keywords: grid4 nofinalgrid
keywords: scfconv7
keywords: smallprint printgap noloewdin
keywords: NOSOSCF
formula: C18H24ClN3O
InChI: InChI=1S/C18H24ClN3O/c1-13(2)17-8-5-15(9-14-3-6-16(19)7-4-14)18(17,23)10-22-12-20-11-21-22/h3-4,6-7,11-13,15,17,23H,5,8-10H2,1-2H3
47 atoms
Cl 5.245887 3.564664 -0.209096
O  -1.709817 -1.200557 1.906701
N  -1.184837 -2.730318 -0.554113
N  -0.744969 -3.41477 0.506749
N  0.275425 -4.130214 -1.351115
C  -1.804341 -0.606828 0.629404
C  -2.897979 0.483547 0.672534
C  -0.570497 0.2596 0.286623
C  -2.594369 1.367897 -0.542216
C  -1.075656 1.231981 -0.783381
C  -4.35699 0.030712 0.871669
C  -2.162147 -1.667587 -0.422194
C  0.745024 -0.436125 -0.064983
C  -5.104051 1.048921 1.730696
C  -5.147329 -0.209292 -0.413223
C  1.884152 0.54434 -0.107829
C  -0.56734 -3.166755 -1.647935
C  2.335672 1.072194 -1.313801
C  2.495317 0.97554 1.067544
C  3.365186 2.001734 -1.356346
C  3.52669 1.901839 1.047488
C  0.129653 -4.235999 -0.020452
C  3.953163 2.408688 -0.170324
H  -2.634037 1.06496 1.564643
H  -0.387574 0.833343 1.203471
H  -2.895997 2.400578 -0.366728
H  -3.143005 1.033898 -1.423516
H  -0.878299 0.837417 -1.783849
H  -0.558644 2.189491 -0.724479
H  -4.334914 -0.909677 1.434097
H  -2.274792 -1.22607 -1.411463
H  -3.114409 -2.12927 -0.158815
H  0.673057 -0.927228 -1.036959
H  0.96827 -1.208702 0.675655
H  -1.225566 -2.036912 1.827434
H  -5.122086 2.031482 1.252872
H  -6.140105 0.746345 1.893897
H  -4.637015 1.166176 2.709896
H  -4.652878 -0.881934 -1.113655
H  -5.341572 0.724956 -0.943566
H  -6.116746 -0.651276 -0.176907
H  -0.758482 -2.762512 -2.629448
H  1.881086 0.75377 -2.244014
H  2.167529 0.578888 2.021118
H  3.701828 2.398094 -2.304585
H  3.992404 2.219248 1.970523
H  0.677373 -4.941462 0.583848
elementType: Cl O N C H
totalener: -1400.15771829 hartree
nucrepener: 2108.81512442 hartree
electener: -3508.97284271 hartree
oneelecener: -6101.44724177 hartree
twoeener: 2592.47439906 hartree
cpcmener: -0.03110483 hartree
kineticenergy: 1395.25904803 hartree
xcener: -114.444636047534 hartree
chargesum: 0.0000000
charge: -0.108338 -0.471124 0.144263 -0.386265 -0.407849 0.524250 -0.033688 -0.029102 -0.230259 -0.212837 -0.009434 -0.275763 -0.102381 -0.303126 -0.314715 0.014568 0.050389 -0.218211 -0.219822 -0.160501 -0.170030 0.082849 0.104978 0.074452 0.082550 0.086434 0.093784 0.085558 0.086638 0.046727 0.126404 0.146026 0.093490 0.109979 0.230807 0.086803 0.091428 0.089167 0.097081 0.083593 0.101821 0.183142 0.138784 0.143068 0.143988 0.144647 0.165779
qa: -0.1083 -0.4711 0.1443 -0.3863 -0.4078 0.5242 -0.0337 -0.0291 -0.2303 -0.2128 -0.0094 -0.2758 -0.1024 -0.3031 -0.3147 0.0146 0.0504 -0.2182 -0.2198 -0.1605 -0.1700 0.0828 0.1050 0.0745 0.0826 0.0864 0.0938 0.0856 0.0866 0.0467 0.1264 0.1460 0.0935 0.1100 0.2308 0.0868 0.0914 0.0892 0.0971 0.0836 0.1018 0.1831 0.1388 0.1431 0.1440 0.1446 0.1658
va: 1.1969 1.9719 3.3369 2.8503 3.0269 3.7223 3.7894 3.7985 4.0040 3.9270 3.8221 3.9898 3.7878 3.9214 3.9425 3.5565 4.0474 3.9665 3.9869 4.0049 3.9991 4.0083 3.8020 1.0267 1.0345 1.0111 1.0017 1.0068 1.0076 1.0374 0.9787 0.9884 1.0064 1.0269 1.0570 1.0005 1.0035 1.0058 1.0000 0.9961 1.0050 0.9903 1.0058 1.0066 1.0058 1.0058 0.9933
dispcorr: -0.026763628 hartree
energy: -1400.184481921406
dipole: -44.79466 43.14034 -1.65432 -3.67675 3.86043 0.18367 1.20440 -2.36411 -1.15971
magnitude: 2.02865 au
magnitude: 5.15643 debye
